:: Synchronizing package databases...
 build-support-manual downloading...
 build-support downloading...
 core-staging downloading...
 extra-staging downloading...
 core-testing downloading...
 core downloading...
 extra-testing downloading...
 extra downloading...
:: Starting full system upgrade...
 there is nothing to do
==> Building in chroot for [extra-staging-with-build-support] (i686)...
==> Synchronizing chroot copy [/var/lib/archbuild/extra-staging-with-build-support-i686/root] -> [build]...done
==> Making package: zeitgeist 1.0.4-5.0 (Wed Feb 19 12:38:09 2025)
==> Retrieving sources...
  -> Updating zeitgeist git repo...
==> Validating source files with b2sums...
    zeitgeist ... Skipped
gpg: Warning: using insecure memory!
==> Appending keys from archlinux32.gpg...
gpg: Warning: using insecure memory!
gpg: Warning: using insecure memory!
gpg: Warning: using insecure memory!
gpg: Warning: using insecure memory!
gpg: Warning: using insecure memory!
gpg: Warning: using insecure memory!
gpg: Warning: using insecure memory!
gpg: Warning: using insecure memory!
gpg: Warning: using insecure memory!
gpg: Warning: using insecure memory!
gpg: Warning: using insecure memory!
gpg: Warning: using insecure memory!
gpg: Warning: using insecure memory!
gpg: Warning: using insecure memory!
==> Updating trust database...
gpg: Warning: using insecure memory!
gpg: next trustdb check due at 2025-06-16
==> Making package: zeitgeist 1.0.4-5.0 (Wed Feb 19 12:38:13 2025)
==> Checking runtime dependencies...
==> Installing missing dependencies...
resolving dependencies...
:: There are 2 providers available for libegl:
:: Repository extra-staging
   1) libglvnd
:: Repository extra
   2) libglvnd

Enter a number (default=1): 
looking for conflicting packages...
warning: dependency cycle detected:
warning: harfbuzz will be installed before its freetype2 dependency
warning: dependency cycle detected:
warning: mesa will be installed before its libglvnd dependency

Packages (81) adobe-source-code-pro-fonts-2.042u+1.062i+1.026vf-2.0  adwaita-cursors-47.0-1.0  adwaita-icon-theme-47.0-1.0  adwaita-icon-theme-legacy-46.2-3.0  at-spi2-core-2.54.0-2.0  avahi-1:0.8+r194+g3f79789-2.0  cairo-1.18.2-2.0  cantarell-fonts-1:0.303.1-2.0  dbus-glib-0.112-4.0  dconf-0.40.0-3.0  default-cursors-3-1.0  desktop-file-utils-0.28-1.0  duktape-2.7.0-7.0  fontconfig-2:2.15.0-2.0  freetype2-2.13.3-1.0  fribidi-1.0.16-1.0  gdk-pixbuf2-2.42.12-2.0  glib-networking-1:2.80.0-3.0  graphite-1:1.3.14-4.0  gsettings-desktop-schemas-47.1-1.0  gsettings-system-schemas-47.1-1.0  gtk-update-icon-cache-1:4.16.7-1.0  harfbuzz-10.1.0-1.0  hicolor-icon-theme-0.18-1.0  iso-codes-4.17.0-1.0  jbigkit-2.1-8.0  lcms2-2.17-1.0  libcloudproviders-0.3.6-1.0  libcolord-1.4.7-2.0  libcups-2:2.4.11-2.0  libdaemon-0.14-6.0  libdatrie-0.2.13-4.0  libdrm-2.4.124-1.0  libedit-20240808_3.1-1.0  libepoxy-1.5.10-3.0  libglvnd-1.7.0-1.1  libjpeg-turbo-3.1.0-1.0  libpciaccess-0.18.1-2.0  libpng-1.6.46-1.0  libproxy-0.5.9-1.0  librsvg-2:2.58.4-1.0  libsoup3-3.6.1-1.0  libstemmer-2.2.0-2.0  libthai-0.1.29-3.0  libtiff-4.7.0-1.0  libx11-1.8.11-1.0  libxau-1.0.12-1.0  libxcb-1.17.0-1.0  libxcomposite-0.4.6-2.0  libxcursor-1.2.3-1.0  libxdamage-1.1.6-2.0  libxdmcp-1.1.5-1.0  libxext-1.3.6-1.0  libxfixes-6.0.1-2.0  libxft-2.3.8-2.0  libxi-1.8.2-1.0  libxinerama-1.1.5-2.0  libxkbcommon-1.7.0-2.1  libxrandr-1.5.4-1.0  libxrender-0.9.12-1.0  libxshmfence-1.3.3-1.0  libxtst-1.2.5-1.0  libxxf86vm-1.1.6-1.0  llvm-libs-18.1.8-4.1  lm_sensors-1:3.6.0.r41.g31d1f125-3.0  lzo-2.10-5.1  mesa-1:24.3.1-3.0  pango-1:1.54.0-1.0  pixman-0.44.2-1.0  shared-mime-info-2.4-1.1  spirv-tools-2024.4.rc2-1.0  tracker3-3.7.3-2.0  wayland-1.23.1-1.0  xcb-proto-1.17.0-3.0  xkeyboard-config-2.43-1.0  xorg-xprop-1.2.8-1.0  xorgproto-2024.1-2.0  gtk3-1:3.24.43-2.0  json-glib-1.10.6-1.0  telepathy-glib-0.24.2-4.0  xapian-core-1:1.4.23-1.0

Total Installed Size:  451.26 MiB

:: Proceed with installation? [Y/n] 
checking keyring...
checking package integrity...
loading package files...
checking for file conflicts...
:: Processing package changes...
installing hicolor-icon-theme...
installing adwaita-icon-theme-legacy...
installing adwaita-cursors...
installing adwaita-icon-theme...
installing dconf...
installing gsettings-system-schemas...
installing adobe-source-code-pro-fonts...
installing cantarell-fonts...
installing gsettings-desktop-schemas...
installing xcb-proto...
installing xorgproto...
installing libxdmcp...
installing libxau...
installing libxcb...
installing libx11...
installing libxext...
installing libxfixes...
installing libxi...
installing libxtst...
installing xorg-xprop...
installing at-spi2-core...
installing libpng...
installing graphite...
Optional dependencies for graphite
    graphite-docs: Documentation
installing harfbuzz...
Optional dependencies for harfbuzz
    harfbuzz-utils: utilities
installing freetype2...
installing fontconfig...
Creating fontconfig configuration...
Rebuilding fontconfig cache...
installing libxrender...
installing lzo...
installing pixman...
installing cairo...
installing desktop-file-utils...
installing fribidi...
installing libjpeg-turbo...
Optional dependencies for libjpeg-turbo
    java-runtime>11: for TurboJPEG Java wrapper
installing jbigkit...
installing libtiff...
Optional dependencies for libtiff
    freeglut: for using tiffgt
installing shared-mime-info...
installing gdk-pixbuf2...
Optional dependencies for gdk-pixbuf2
    libwmf: Load .wmf and .apm
    libopenraw: Load .dng, .cr2, .crw, .nef, .orf, .pef, .arw, .erf, .mrw, and .raf
    libavif: Load .avif
    libheif: Load .heif, .heic, and .avif
    libjxl: Load .jxl
    librsvg: Load .svg, .svgz, and .svg.gz [pending]
    webp-pixbuf-loader: Load .webp
installing iso-codes...
installing libcloudproviders...
installing lcms2...
installing libcolord...
installing libdaemon...
installing avahi...
Optional dependencies for avahi
    gtk3: avahi-discover, avahi-discover-standalone, bshell, bssh, bvnc [pending]
    libevent: libevent bindings [installed]
    nss-mdns: NSS support for mDNS
    python-dbus: avahi-bookmarks, avahi-discover
    python-gobject: avahi-bookmarks, avahi-discover
    python-twisted: avahi-bookmarks
    qt5-base: qt5 bindings
installing libcups...
installing libpciaccess...
installing libdrm...
Optional dependencies for libdrm
    cairo: needed for modetest tool [installed]
installing libxshmfence...
installing libxxf86vm...
installing libedit...
installing llvm-libs...
installing lm_sensors...
Optional dependencies for lm_sensors
    perl: for sensor detection and configuration convert [installed]
    rrdtool: for logging with sensord
installing spirv-tools...
installing default-cursors...
Optional dependencies for default-cursors
    adwaita-cursors: default cursor theme [installed]
installing wayland...
installing mesa...
Optional dependencies for mesa
    opengl-man-pages: for the OpenGL API man pages
installing libglvnd...
installing libepoxy...
installing libdatrie...
installing libthai...
installing libxft...
installing pango...
installing librsvg...
installing libxcomposite...
installing libxcursor...
installing libxdamage...
installing libxinerama...
installing xkeyboard-config...
installing libxkbcommon...
Optional dependencies for libxkbcommon
    libxkbcommon-x11: xkbcli interactive-x11
    wayland: xkbcli interactive-wayland [installed]
installing libxrandr...
installing json-glib...
installing duktape...
installing libproxy...
Optional dependencies for libproxy
    webkit2gtk: PAC proxy support (Webkit2gtk engine)
installing glib-networking...
installing libsoup3...
Optional dependencies for libsoup3
    samba: Windows Domain SSO
installing libstemmer...
installing tracker3...
Optional dependencies for tracker3
    libsoup: Alternative remoting backend
installing gtk-update-icon-cache...
installing gtk3...
Optional dependencies for gtk3
    evince: Default print preview command
installing dbus-glib...
installing telepathy-glib...
installing xapian-core...
:: Running post-transaction hooks...
( 1/14) Creating system user accounts...
Creating group 'avahi' with GID 972.
Creating user 'avahi' (Avahi mDNS/DNS-SD daemon) with UID 972 and GID 972.
( 2/14) Reloading system manager configuration...
  Skipped: Current root is not booted.
( 3/14) Reloading user manager configuration...
  Skipped: Current root is not booted.
( 4/14) Arming ConditionNeedsUpdate...
( 5/14) Updating the MIME type database...
( 6/14) Updating fontconfig configuration...
( 7/14) Reloading system bus configuration...
  Skipped: Current root is not booted.
( 8/14) Updating fontconfig cache...
( 9/14) Probing GDK-Pixbuf loader modules...
(10/14) Updating GIO module cache...
(11/14) Compiling GSettings XML schema files...
(12/14) Probing GTK3 input method modules...
(13/14) Updating icon theme caches...
(14/14) Updating the desktop file MIME type cache...
==> Checking buildtime dependencies...
==> Installing missing dependencies...
resolving dependencies...
:: There are 10 providers available for ttf-font:
:: Repository extra
   1) gnu-free-fonts  2) noto-fonts  3) ttf-bitstream-vera  4) ttf-croscore  5) ttf-dejavu  6) ttf-droid  7) ttf-ibm-plex  8) ttf-input  9) ttf-input-nerd  10) ttf-liberation

Enter a number (default=1): 
looking for conflicting packages...

Packages (73) aom-3.12.0-1.0  dav1d-1.5.1-1.0  docbook-xml-4.5-10.0  docbook-xsl-1.79.2-9.0  gd-2.3.3-8.0  ghostscript-10.04.0-1.0  giflib-5.2.2-1.1  glib2-docs-2.80.0-3  gnu-free-fonts-20120503-8.0  gobject-introspection-runtime-1.82.0-1.0  graphviz-12.1.2-1.0  gsfonts-20200910-4.0  gtk-doc-1.34.0-1.0  gts-0.7.6.121130-3.0  ijs-0.35-6.0  jbig2dec-0.20-1.0  libavif-1.1.1-2.0  libde265-1.0.15-2.0  libfontenc-1.1.8-1.0  libgirepository-1.82.0-1.0  libheif-1.18.2-1.1  libice-1.1.2-1.0  libidn-1.42-1.0  libpaper-2.2.6-1.0  libsm-1.2.5-1.0  libunwind-1.8.1-3.2  libwebp-1.5.0-1.0  libxfont2-2.0.7-1.0  libxkbfile-1.1.3-1.0  libxmu-1.2.1-1.0  libxpm-3.5.17-2.0  libxslt-1.1.42-1.1  libxt-1.3.1-1.0  libyuv-r2426+464c51a03-1.0  netpbm-10.86.43-1.0  openjpeg2-2.5.3-1.0  perl-error-0.17029-7.0  perl-mailtools-2.22-1.0  perl-timedate-2.33-7.0  poppler-data-0.4.12-2.0  python-autocommand-2.2.2-6.0  python-fastjsonschema-2.20.0-1.0  python-isodate-0.6.1-4.0  python-jaraco.context-5.3.0-1.0  python-jaraco.functools-4.0.2-1.0  python-jaraco.text-4.0.0-1.0  python-lxml-5.3.0-1.0  python-mako-1.3.6-1.0  python-markdown-3.7-1.0  python-markupsafe-2.1.5-2.2  python-more-itertools-10.3.0-1.0  python-ordered-set-4.1.0-5.1  python-platformdirs-4.3.6-1.0  python-pygments-2.18.0-1.0  python-pyparsing-3.1.2-2.1  python-setuptools-1:69.5.1-1.1  python-six-1.16.0-9.1  python-tomli-2.0.1-4.1  python-trove-classifiers-2024.10.21.16-1.0  python-validate-pyproject-0.22-1.0  rav1e-0.7.1-1.0  x265-4.0-1.0  xorg-fonts-encodings-1.1.0-1.0  xorg-server-common-21.1.15-1.0  xorg-setxkbmap-1.3.4-2.0  xorg-xauth-1.1.3-1.0  xorg-xkbcomp-1.4.7-1.0  git-2.47.1-1.0  gobject-introspection-1.82.0-1.0  python-rdflib-7.1.1-1.0  raptor-2.0.16-5.0  vala-0.56.17-1.0  xorg-server-xvfb-21.1.15-1.0

Total Installed Size:  237.36 MiB

:: Proceed with installation? [Y/n] 
checking keyring...
checking package integrity...
loading package files...
checking for file conflicts...
:: Processing package changes...
installing perl-error...
installing perl-timedate...
installing perl-mailtools...
installing git...
Optional dependencies for git
    tk: gitk and git gui
    openssh: ssh transport and crypto
    perl-libwww: git svn
    perl-term-readkey: git svn and interactive.singlekey setting
    perl-io-socket-ssl: git send-email TLS support
    perl-authen-sasl: git send-email TLS support
    perl-mediawiki-api: git mediawiki support
    perl-datetime-format-iso8601: git mediawiki support
    perl-lwp-protocol-https: git mediawiki https support
    perl-cgi: gitweb (web interface) support
    python: git svn & git p4 [installed]
    subversion: git svn
    org.freedesktop.secrets: keyring credential helper
    libsecret: libsecret credential helper [installed]
installing libgirepository...
installing gobject-introspection-runtime...
installing python-more-itertools...
installing python-jaraco.functools...
installing python-jaraco.context...
installing python-autocommand...
installing python-jaraco.text...
Optional dependencies for python-jaraco.text
    python-inflect: for show-newlines script
installing python-ordered-set...
installing python-platformdirs...
installing python-tomli...
installing python-fastjsonschema...
installing python-trove-classifiers...
installing python-validate-pyproject...
installing python-setuptools...
installing python-markupsafe...
installing python-mako...
Optional dependencies for python-mako
    python-babel: for i18n features
    python-beaker: for caching support
    python-dogpile.cache: for caching support
    python-pygments: for syntax highlighting [pending]
    python-pytest: for testing utilities
installing python-markdown...
Optional dependencies for python-markdown
    python-yaml: parse Python in YAML metadata
installing gobject-introspection...
installing python-six...
installing python-isodate...
installing python-pyparsing...
Optional dependencies for python-pyparsing
    python-railroad-diagrams: for generating Railroad Diagrams
    python-jinja: for generating Railroad Diagrams
installing python-rdflib...
Optional dependencies for python-rdflib
    python-html5lib: for html support
installing libxslt...
Optional dependencies for libxslt
    python: Python bindings [installed]
installing raptor...
installing libice...
installing libsm...
installing libxt...
installing libxpm...
installing giflib...
installing libwebp...
installing aom...
installing dav1d...
Optional dependencies for dav1d
    dav1d-doc: HTML documentation
installing rav1e...
installing libyuv...
installing libavif...
installing libde265...
Optional dependencies for libde265
    ffmpeg: for sherlock265
    qt5-base: for sherlock265
    sdl: dec265 YUV overlay output
installing x265...
installing libheif...
Optional dependencies for libheif
    libjpeg: for heif-convert and heif-enc [installed]
    libpng: for heif-convert and heif-enc [installed]
    dav1d: dav1d encoder [installed]
    ffmpeg: hardware decode
    rav1e: rav1e encoder [installed]
    svt-av1: svt-av1 encoder
installing gd...
Optional dependencies for gd
    perl: bdftogd script [installed]
installing jbig2dec...
installing libpaper...
installing ijs...
installing openjpeg2...
installing libidn...
installing poppler-data...
installing ghostscript...
Optional dependencies for ghostscript
    gtk3: needed for gsx [installed]
installing netpbm...
installing gts...
installing gsfonts...
installing graphviz...
Warning: Could not load "/usr/lib/graphviz/libgvplugin_gd.so.6" - It was found, so perhaps one of its dependents was not.  Try ldd.
Warning: Could not load "/usr/lib/graphviz/libgvplugin_gd.so.6" - It was found, so perhaps one of its dependents was not.  Try ldd.
Optional dependencies for graphviz
    mono: sharp bindings
    guile: guile bindings [installed]
    lua: lua bindings
    perl: perl bindings [installed]
    python: python bindings [installed]
    r: r bindings
    tcl: tcl bindings
    qt6-base: gvedit
    xterm: vimdot
installing docbook-xml...
installing docbook-xsl...
installing glib2-docs...
installing python-lxml...
Optional dependencies for python-lxml
    python-beautifulsoup4: support for beautifulsoup parser to parse not well formed HTML
    python-cssselect: support for cssselect
    python-html5lib: support for html5lib parser
    python-lxml-docs: offline docs
    python-lxml-html-clean: enable htmlclean feature
installing python-pygments...
installing gtk-doc...
Optional dependencies for gtk-doc
    dblatex: PDF support
installing gnu-free-fonts...
installing vala...
installing xorg-fonts-encodings...
installing libfontenc...
installing libxfont2...
installing libunwind...
installing libxkbfile...
installing xorg-xkbcomp...
installing xorg-setxkbmap...
installing xorg-server-common...
installing libxmu...
installing xorg-xauth...
installing xorg-server-xvfb...
:: Running post-transaction hooks...
(1/8) Creating system user accounts...
Creating group 'git' with GID 971.
Creating user 'git' (git daemon user) with UID 971 and GID 971.
(2/8) Reloading system manager configuration...
  Skipped: Current root is not booted.
(3/8) Arming ConditionNeedsUpdate...
(4/8) Updating fontconfig configuration...
(5/8) Warn about old perl modules
(6/8) Updating fontconfig cache...
(7/8) Probing GDK-Pixbuf loader modules...
g_module_open() failed for /usr/lib/gdk-pixbuf-2.0/2.10.0/loaders/libpixbufloader-heif.so: libx265.so.209: cannot open shared object file: No such file or directory
(8/8) Updating the info directory file...
==> Retrieving sources...
==> WARNING: Skipping all source file integrity checks.
==> Extracting sources...
  -> Creating working copy of zeitgeist git repo...
Cloning into 'zeitgeist'...
done.
Switched to a new branch 'makepkg'
==> Starting prepare()...
autopoint: using AM_GNU_GETTEXT_REQUIRE_VERSION instead of AM_GNU_GETTEXT_VERSION
Copying file ABOUT-NLS
Creating directory build-aux
Copying file build-aux/config.rpath
Creating directory m4
Copying file m4/build-to-host.m4
Copying file m4/gettext.m4
Copying file m4/host-cpu-c-abi.m4
Copying file m4/iconv.m4
Copying file m4/intlmacosx.m4
Copying file m4/lib-ld.m4
Copying file m4/lib-link.m4
Copying file m4/lib-prefix.m4
Copying file m4/nls.m4
Copying file m4/po.m4
Copying file m4/progtest.m4
Copying file po/Makefile.in.in
Copying file po/Makevars.template
Copying file po/Rules-quot
Copying file po/boldquot.sed
Copying file po/en@boldquot.header
Copying file po/en@quot.header
Copying file po/insert-header.sed
Copying file po/quot.sed
Copying file po/remove-potcdate.sed
aclocal: installing 'm4/introspection.m4' from '/usr/share/aclocal/introspection.m4'
aclocal: installing 'm4/libtool.m4' from '/usr/share/aclocal/libtool.m4'
aclocal: installing 'm4/ltoptions.m4' from '/usr/share/aclocal/ltoptions.m4'
aclocal: installing 'm4/ltsugar.m4' from '/usr/share/aclocal/ltsugar.m4'
aclocal: installing 'm4/ltversion.m4' from '/usr/share/aclocal/ltversion.m4'
aclocal: installing 'm4/lt~obsolete.m4' from '/usr/share/aclocal/lt~obsolete.m4'
aclocal: installing 'm4/pkg.m4' from '/usr/share/aclocal/pkg.m4'
libtoolize: putting auxiliary files in AC_CONFIG_AUX_DIR, 'build-aux'.
libtoolize: copying file 'build-aux/ltmain.sh'
libtoolize: putting macros in AC_CONFIG_MACRO_DIRS, 'm4'.
libtoolize: copying file 'm4/libtool.m4'
libtoolize: copying file 'm4/ltoptions.m4'
libtoolize: copying file 'm4/ltsugar.m4'
libtoolize: copying file 'm4/ltversion.m4'
libtoolize: copying file 'm4/lt~obsolete.m4'
configure.ac:16: installing 'build-aux/compile'
configure.ac:23: installing 'build-aux/config.guess'
configure.ac:23: installing 'build-aux/config.sub'
configure.ac:11: installing 'build-aux/install-sh'
configure.ac:11: installing 'build-aux/missing'
Makefile.am: installing './INSTALL'
datahub/Makefile.am: installing 'build-aux/depcomp'
extensions/fts++/test/Makefile.am:18: warning: source file '$(srcdir)/../stringutils.cpp' is in a subdirectory,
extensions/fts++/test/Makefile.am:18: but option 'subdir-objects' is disabled
automake: warning: possible forward-incompatibility.
automake: At least one source file is in a subdirectory, but the 'subdir-objects'
automake: automake option hasn't been enabled.  For now, the corresponding output
automake: object file(s) will be placed in the top-level directory.  However, this
automake: behavior may change in a future Automake major version, with object
automake: files being placed in the same subdirectory as the corresponding sources.
automake: You are advised to start using 'subdir-objects' option throughout your
automake: project, to avoid future incompatibility.
extensions/fts++/test/Makefile.am:18: warning: source file '$(srcdir)/../controller.cpp' is in a subdirectory,
extensions/fts++/test/Makefile.am:18: but option 'subdir-objects' is disabled
extensions/fts++/test/Makefile.am:18: warning: source file '$(srcdir)/../indexer.cpp' is in a subdirectory,
extensions/fts++/test/Makefile.am:18: but option 'subdir-objects' is disabled
extensions/fts++/test/Makefile.am:18: warning: source file '$(srcdir)/../task.cpp' is in a subdirectory,
extensions/fts++/test/Makefile.am:18: but option 'subdir-objects' is disabled
extensions/fts++/test/Makefile.am:18: warning: source file '$(srcdir)/../fts.cpp' is in a subdirectory,
extensions/fts++/test/Makefile.am:18: but option 'subdir-objects' is disabled
parallel-tests: installing 'build-aux/test-driver'
python/Makefile.am:5: installing 'build-aux/py-compile'
==> Starting build()...
checking for a BSD-compatible install... /usr/bin/install -c
checking whether sleep supports fractional seconds... yes
checking filesystem timestamp resolution... 0.01
checking whether build environment is sane... yes
checking for a race-free mkdir -p... /usr/bin/mkdir -p
checking for gawk... gawk
checking whether make sets $(MAKE)... yes
checking whether make supports nested variables... yes
checking xargs -n works... yes
checking whether UID '1000' is supported by ustar format... yes
checking whether GID '1000' is supported by ustar format... yes
checking how to create a ustar tar archive... gnutar
checking whether to enable maintainer-specific portions of Makefiles... yes
checking for a Python interpreter with version >= 3... python
checking for python... /usr/bin/python
checking for python version... 3.13
checking for python platform... linux
checking for GNU default python prefix... ${prefix}
checking for GNU default python exec_prefix... ${exec_prefix}
checking for python script directory (pythondir)... ${PYTHON_PREFIX}/lib/python3.13/site-packages
checking for python extension module directory (pyexecdir)... ${PYTHON_EXEC_PREFIX}/lib/python3.13/site-packages
checking for gcc... gcc
checking whether the C compiler works... yes
checking for C compiler default output file name... a.out
checking for suffix of executables... 
checking whether we are cross compiling... no
checking for suffix of object files... o
checking whether the compiler supports GNU C... yes
checking whether gcc accepts -g... yes
checking for gcc option to enable C11 features... none needed
checking whether gcc understands -c and -o together... yes
checking whether make supports the include directive... yes (GNU style)
checking dependency style of gcc... gcc3
checking for g++... g++
checking whether the compiler supports GNU C++... yes
checking whether g++ accepts -g... yes
checking for g++ option to enable C++11 features... none needed
checking dependency style of g++... gcc3
checking whether g++ understands -c and -o together... yes
checking build system type... i686-pc-linux-gnu
checking host system type... i686-pc-linux-gnu
checking how to print strings... printf
checking for a sed that does not truncate output... /usr/bin/sed
checking for grep that handles long lines and -e... /usr/bin/grep
checking for egrep... /usr/bin/grep -E
checking for fgrep... /usr/bin/grep -F
checking for ld used by gcc... /usr/bin/ld
checking if the linker (/usr/bin/ld) is GNU ld... yes
checking for BSD- or MS-compatible name lister (nm)... /usr/bin/nm -B
checking the name lister (/usr/bin/nm -B) interface... BSD nm
checking whether ln -s works... yes
checking the maximum length of command line arguments... 1572864
checking how to convert i686-pc-linux-gnu file names to i686-pc-linux-gnu format... func_convert_file_noop
checking how to convert i686-pc-linux-gnu file names to toolchain format... func_convert_file_noop
checking for /usr/bin/ld option to reload object files... -r
checking for file... file
checking for objdump... objdump
checking how to recognize dependent libraries... pass_all
checking for dlltool... no
checking how to associate runtime and link libraries... printf %s\n
checking for ranlib... ranlib
checking for ar... ar
checking for archiver @FILE support... @
checking for strip... strip
checking command to parse /usr/bin/nm -B output from gcc object... ok
checking for sysroot... no
checking for a working dd... /usr/bin/dd
checking how to truncate binary pipes... /usr/bin/dd bs=4096 count=1
checking for mt... no
checking if : is a manifest tool... no
checking for stdio.h... yes
checking for stdlib.h... yes
checking for string.h... yes
checking for inttypes.h... yes
checking for stdint.h... yes
checking for strings.h... yes
checking for sys/stat.h... yes
checking for sys/types.h... yes
checking for unistd.h... yes
checking for dlfcn.h... yes
checking for objdir... .libs
checking if gcc supports -fno-rtti -fno-exceptions... no
checking for gcc option to produce PIC... -fPIC -DPIC
checking if gcc PIC flag -fPIC -DPIC works... yes
checking if gcc static flag -static works... yes
checking if gcc supports -c -o file.o... yes
checking if gcc supports -c -o file.o... (cached) yes
checking whether the gcc linker (/usr/bin/ld) supports shared libraries... yes
checking whether -lc should be explicitly linked in... no
checking dynamic linker characteristics... GNU/Linux ld.so
checking how to hardcode library paths into programs... immediate
checking whether stripping libraries is possible... yes
checking if libtool supports shared libraries... yes
checking whether to build shared libraries... yes
checking whether to build static libraries... no
checking how to run the C++ preprocessor... g++ -E
checking for ld used by g++... /usr/bin/ld
checking if the linker (/usr/bin/ld) is GNU ld... yes
checking whether the g++ linker (/usr/bin/ld) supports shared libraries... yes
checking for g++ option to produce PIC... -fPIC -DPIC
checking if g++ PIC flag -fPIC -DPIC works... yes
checking if g++ static flag -static works... yes
checking if g++ supports -c -o file.o... yes
checking if g++ supports -c -o file.o... (cached) yes
checking whether the g++ linker (/usr/bin/ld) supports shared libraries... yes
checking dynamic linker characteristics... (cached) GNU/Linux ld.so
checking how to hardcode library paths into programs... immediate
checking for pkg-config... /usr/bin/pkg-config
checking pkg-config is at least version 0.21... yes
checking for valac... /usr/bin/valac
checking whether /usr/bin/valac supports at least API version 0.32.1... yes
checking whether NLS is requested... yes
checking for msgfmt... /usr/bin/msgfmt
checking for gmsgfmt... /usr/bin/msgfmt
checking for xgettext... /usr/bin/xgettext
checking for msgmerge... /usr/bin/msgmerge
checking for ld... /usr/bin/ld
checking if the linker (/usr/bin/ld) is GNU ld... yes
checking for shared library run path origin... done
checking 32-bit host C ABI... yes
checking how to run the C preprocessor... gcc -E
checking for egrep -e... (cached) /usr/bin/grep -E
checking for ELF binary format... yes
checking for the common suffixes of directories in the library search path... lib,lib,lib
checking for CFPreferencesCopyAppValue... no
checking for CFLocaleCopyPreferredLanguages... no
checking for GNU gettext in libc... yes
checking whether to use NLS... yes
checking where the gettext function comes from... libc
checking for glib-2.0 >= 2.35.4
                    gobject-2.0 >= 2.35.4
                    gmodule-2.0 >= 2.35.4
                    gio-unix-2.0 >= 2.35.4
                    sqlite3 >= 3.7.11... yes
checking for xapian-config... yes
checking for telepathy-glib >= 0.18.0... yes
checking for glib-2.0 >= 2.35.4
                            gobject-2.0 >= 2.35.4
                            gio-2.0 >= 2.35.4
                            gio-unix-2.0 >= 2.35.4
                            gtk+-3.0 >= 3.0.0
                            json-glib-1.0 >= 0.14.0 telepathy-glib >= 0.18.0... yes
checking for gobject-introspection... yes
checking for python3-rdflib... configure: error: in '/build/zeitgeist/src/zeitgeist':
configure: error: failed.  Please install the python3-rdflib package.
See 'config.log' for more details
==> ERROR: A failure occurred in build().
    Aborting...
==> ERROR: Build failed, check /var/lib/archbuild/extra-staging-with-build-support-i686/build/build
/var/lib/archbuild/extra-staging-with-build-support-i686/build/build/zeitgeist/src/zeitgeist/config.log:This file contains any messages produced by compilers while
/var/lib/archbuild/extra-staging-with-build-support-i686/build/build/zeitgeist/src/zeitgeist/config.log:running configure, to aid debugging if configure makes a mistake.
/var/lib/archbuild/extra-staging-with-build-support-i686/build/build/zeitgeist/src/zeitgeist/config.log:
/var/lib/archbuild/extra-staging-with-build-support-i686/build/build/zeitgeist/src/zeitgeist/config.log:It was created by zeitgeist configure 1.0.4, which was
/var/lib/archbuild/extra-staging-with-build-support-i686/build/build/zeitgeist/src/zeitgeist/config.log:generated by GNU Autoconf 2.72.  Invocation command line was
/var/lib/archbuild/extra-staging-with-build-support-i686/build/build/zeitgeist/src/zeitgeist/config.log:
/var/lib/archbuild/extra-staging-with-build-support-i686/build/build/zeitgeist/src/zeitgeist/config.log:  $ ./configure --prefix=/usr --sysconfdir=/etc --localstatedir=/var --libexecdir=/usr/lib --enable-fts
/var/lib/archbuild/extra-staging-with-build-support-i686/build/build/zeitgeist/src/zeitgeist/config.log:
/var/lib/archbuild/extra-staging-with-build-support-i686/build/build/zeitgeist/src/zeitgeist/config.log:## --------- ##
/var/lib/archbuild/extra-staging-with-build-support-i686/build/build/zeitgeist/src/zeitgeist/config.log:## Platform. ##
/var/lib/archbuild/extra-staging-with-build-support-i686/build/build/zeitgeist/src/zeitgeist/config.log:## --------- ##
/var/lib/archbuild/extra-staging-with-build-support-i686/build/build/zeitgeist/src/zeitgeist/config.log:
/var/lib/archbuild/extra-staging-with-build-support-i686/build/build/zeitgeist/src/zeitgeist/config.log:hostname = arch-nspawn-4057384
/var/lib/archbuild/extra-staging-with-build-support-i686/build/build/zeitgeist/src/zeitgeist/config.log:uname -m = i686
/var/lib/archbuild/extra-staging-with-build-support-i686/build/build/zeitgeist/src/zeitgeist/config.log:uname -r = 6.13.2-arch1-1
/var/lib/archbuild/extra-staging-with-build-support-i686/build/build/zeitgeist/src/zeitgeist/config.log:uname -s = Linux
/var/lib/archbuild/extra-staging-with-build-support-i686/build/build/zeitgeist/src/zeitgeist/config.log:uname -v = #1 SMP PREEMPT_DYNAMIC Sat, 08 Feb 2025 18:54:55 +0000
/var/lib/archbuild/extra-staging-with-build-support-i686/build/build/zeitgeist/src/zeitgeist/config.log:
/var/lib/archbuild/extra-staging-with-build-support-i686/build/build/zeitgeist/src/zeitgeist/config.log:/usr/bin/uname -p = unknown
/var/lib/archbuild/extra-staging-with-build-support-i686/build/build/zeitgeist/src/zeitgeist/config.log:/bin/uname -X     = unknown
/var/lib/archbuild/extra-staging-with-build-support-i686/build/build/zeitgeist/src/zeitgeist/config.log:
/var/lib/archbuild/extra-staging-with-build-support-i686/build/build/zeitgeist/src/zeitgeist/config.log:/bin/arch              = unknown
/var/lib/archbuild/extra-staging-with-build-support-i686/build/build/zeitgeist/src/zeitgeist/config.log:/usr/bin/arch -k       = unknown
/var/lib/archbuild/extra-staging-with-build-support-i686/build/build/zeitgeist/src/zeitgeist/config.log:/usr/convex/getsysinfo = unknown
/var/lib/archbuild/extra-staging-with-build-support-i686/build/build/zeitgeist/src/zeitgeist/config.log:/usr/bin/hostinfo      = unknown
/var/lib/archbuild/extra-staging-with-build-support-i686/build/build/zeitgeist/src/zeitgeist/config.log:/bin/machine           = unknown
/var/lib/archbuild/extra-staging-with-build-support-i686/build/build/zeitgeist/src/zeitgeist/config.log:/usr/bin/oslevel       = unknown
/var/lib/archbuild/extra-staging-with-build-support-i686/build/build/zeitgeist/src/zeitgeist/config.log:/bin/universe          = unknown
/var/lib/archbuild/extra-staging-with-build-support-i686/build/build/zeitgeist/src/zeitgeist/config.log:
/var/lib/archbuild/extra-staging-with-build-support-i686/build/build/zeitgeist/src/zeitgeist/config.log:PATH: /usr/local/sbin/
/var/lib/archbuild/extra-staging-with-build-support-i686/build/build/zeitgeist/src/zeitgeist/config.log:PATH: /usr/local/bin/
/var/lib/archbuild/extra-staging-with-build-support-i686/build/build/zeitgeist/src/zeitgeist/config.log:PATH: /usr/bin/
/var/lib/archbuild/extra-staging-with-build-support-i686/build/build/zeitgeist/src/zeitgeist/config.log:PATH: /usr/bin/site_perl/
/var/lib/archbuild/extra-staging-with-build-support-i686/build/build/zeitgeist/src/zeitgeist/config.log:PATH: /usr/bin/vendor_perl/
/var/lib/archbuild/extra-staging-with-build-support-i686/build/build/zeitgeist/src/zeitgeist/config.log:PATH: /usr/bin/core_perl/
/var/lib/archbuild/extra-staging-with-build-support-i686/build/build/zeitgeist/src/zeitgeist/config.log:
/var/lib/archbuild/extra-staging-with-build-support-i686/build/build/zeitgeist/src/zeitgeist/config.log:
/var/lib/archbuild/extra-staging-with-build-support-i686/build/build/zeitgeist/src/zeitgeist/config.log:## ----------- ##
/var/lib/archbuild/extra-staging-with-build-support-i686/build/build/zeitgeist/src/zeitgeist/config.log:## Core tests. ##
/var/lib/archbuild/extra-staging-with-build-support-i686/build/build/zeitgeist/src/zeitgeist/config.log:## ----------- ##
/var/lib/archbuild/extra-staging-with-build-support-i686/build/build/zeitgeist/src/zeitgeist/config.log:
/var/lib/archbuild/extra-staging-with-build-support-i686/build/build/zeitgeist/src/zeitgeist/config.log:configure:3034: looking for aux files: config.rpath config.guess config.sub ltmain.sh compile missing install-sh
/var/lib/archbuild/extra-staging-with-build-support-i686/build/build/zeitgeist/src/zeitgeist/config.log:configure:3047:  trying ./build-aux/
/var/lib/archbuild/extra-staging-with-build-support-i686/build/build/zeitgeist/src/zeitgeist/config.log:configure:3076:   ./build-aux/config.rpath found
/var/lib/archbuild/extra-staging-with-build-support-i686/build/build/zeitgeist/src/zeitgeist/config.log:configure:3076:   ./build-aux/config.guess found
/var/lib/archbuild/extra-staging-with-build-support-i686/build/build/zeitgeist/src/zeitgeist/config.log:configure:3076:   ./build-aux/config.sub found
/var/lib/archbuild/extra-staging-with-build-support-i686/build/build/zeitgeist/src/zeitgeist/config.log:configure:3076:   ./build-aux/ltmain.sh found
/var/lib/archbuild/extra-staging-with-build-support-i686/build/build/zeitgeist/src/zeitgeist/config.log:configure:3076:   ./build-aux/compile found
/var/lib/archbuild/extra-staging-with-build-support-i686/build/build/zeitgeist/src/zeitgeist/config.log:configure:3076:   ./build-aux/missing found
/var/lib/archbuild/extra-staging-with-build-support-i686/build/build/zeitgeist/src/zeitgeist/config.log:configure:3058:   ./build-aux/install-sh found
/var/lib/archbuild/extra-staging-with-build-support-i686/build/build/zeitgeist/src/zeitgeist/config.log:configure:3214: checking for a BSD-compatible install
/var/lib/archbuild/extra-staging-with-build-support-i686/build/build/zeitgeist/src/zeitgeist/config.log:configure:3288: result: /usr/bin/install -c
/var/lib/archbuild/extra-staging-with-build-support-i686/build/build/zeitgeist/src/zeitgeist/config.log:configure:3299: checking whether sleep supports fractional seconds
/var/lib/archbuild/extra-staging-with-build-support-i686/build/build/zeitgeist/src/zeitgeist/config.log:configure:3315: result: yes
/var/lib/archbuild/extra-staging-with-build-support-i686/build/build/zeitgeist/src/zeitgeist/config.log:configure:3318: checking filesystem timestamp resolution
/var/lib/archbuild/extra-staging-with-build-support-i686/build/build/zeitgeist/src/zeitgeist/config.log:configure:3453: result: 0.01
/var/lib/archbuild/extra-staging-with-build-support-i686/build/build/zeitgeist/src/zeitgeist/config.log:configure:3458: checking whether build environment is sane
/var/lib/archbuild/extra-staging-with-build-support-i686/build/build/zeitgeist/src/zeitgeist/config.log:configure:3499: result: yes
/var/lib/archbuild/extra-staging-with-build-support-i686/build/build/zeitgeist/src/zeitgeist/config.log:configure:3670: checking for a race-free mkdir -p
/var/lib/archbuild/extra-staging-with-build-support-i686/build/build/zeitgeist/src/zeitgeist/config.log:configure:3713: result: /usr/bin/mkdir -p
/var/lib/archbuild/extra-staging-with-build-support-i686/build/build/zeitgeist/src/zeitgeist/config.log:configure:3720: checking for gawk
/var/lib/archbuild/extra-staging-with-build-support-i686/build/build/zeitgeist/src/zeitgeist/config.log:configure:3741: found /usr/bin/gawk
/var/lib/archbuild/extra-staging-with-build-support-i686/build/build/zeitgeist/src/zeitgeist/config.log:configure:3753: result: gawk
/var/lib/archbuild/extra-staging-with-build-support-i686/build/build/zeitgeist/src/zeitgeist/config.log:configure:3764: checking whether make sets $(MAKE)
/var/lib/archbuild/extra-staging-with-build-support-i686/build/build/zeitgeist/src/zeitgeist/config.log:configure:3788: result: yes
/var/lib/archbuild/extra-staging-with-build-support-i686/build/build/zeitgeist/src/zeitgeist/config.log:configure:3814: checking whether make supports nested variables
/var/lib/archbuild/extra-staging-with-build-support-i686/build/build/zeitgeist/src/zeitgeist/config.log:configure:3833: result: yes
/var/lib/archbuild/extra-staging-with-build-support-i686/build/build/zeitgeist/src/zeitgeist/config.log:configure:3847: checking xargs -n works
/var/lib/archbuild/extra-staging-with-build-support-i686/build/build/zeitgeist/src/zeitgeist/config.log:configure:3863: result: yes
/var/lib/archbuild/extra-staging-with-build-support-i686/build/build/zeitgeist/src/zeitgeist/config.log:configure:3948: checking whether UID '1000' is supported by ustar format
/var/lib/archbuild/extra-staging-with-build-support-i686/build/build/zeitgeist/src/zeitgeist/config.log:configure:3954: result: yes
/var/lib/archbuild/extra-staging-with-build-support-i686/build/build/zeitgeist/src/zeitgeist/config.log:configure:3961: checking whether GID '1000' is supported by ustar format
/var/lib/archbuild/extra-staging-with-build-support-i686/build/build/zeitgeist/src/zeitgeist/config.log:configure:3967: result: yes
/var/lib/archbuild/extra-staging-with-build-support-i686/build/build/zeitgeist/src/zeitgeist/config.log:configure:3975: checking how to create a ustar tar archive
/var/lib/archbuild/extra-staging-with-build-support-i686/build/build/zeitgeist/src/zeitgeist/config.log:configure:3986: tar --version
/var/lib/archbuild/extra-staging-with-build-support-i686/build/build/zeitgeist/src/zeitgeist/config.log:tar (GNU tar) 1.35
/var/lib/archbuild/extra-staging-with-build-support-i686/build/build/zeitgeist/src/zeitgeist/config.log:Copyright (C) 2023 Free Software Foundation, Inc.
/var/lib/archbuild/extra-staging-with-build-support-i686/build/build/zeitgeist/src/zeitgeist/config.log:License GPLv3+: GNU GPL version 3 or later <https://gnu.org/licenses/gpl.html>.
/var/lib/archbuild/extra-staging-with-build-support-i686/build/build/zeitgeist/src/zeitgeist/config.log:This is free software: you are free to change and redistribute it.
/var/lib/archbuild/extra-staging-with-build-support-i686/build/build/zeitgeist/src/zeitgeist/config.log:There is NO WARRANTY, to the extent permitted by law.
/var/lib/archbuild/extra-staging-with-build-support-i686/build/build/zeitgeist/src/zeitgeist/config.log:
/var/lib/archbuild/extra-staging-with-build-support-i686/build/build/zeitgeist/src/zeitgeist/config.log:Written by John Gilmore and Jay Fenlason.
/var/lib/archbuild/extra-staging-with-build-support-i686/build/build/zeitgeist/src/zeitgeist/config.log:configure:3989: $? = 0
/var/lib/archbuild/extra-staging-with-build-support-i686/build/build/zeitgeist/src/zeitgeist/config.log:configure:4029: tardir=conftest.dir && eval tar --format=ustar -chf - "$tardir" >conftest.tar
/var/lib/archbuild/extra-staging-with-build-support-i686/build/build/zeitgeist/src/zeitgeist/config.log:configure:4032: $? = 0
/var/lib/archbuild/extra-staging-with-build-support-i686/build/build/zeitgeist/src/zeitgeist/config.log:configure:4036: tar -xf - <conftest.tar
/var/lib/archbuild/extra-staging-with-build-support-i686/build/build/zeitgeist/src/zeitgeist/config.log:configure:4039: $? = 0
/var/lib/archbuild/extra-staging-with-build-support-i686/build/build/zeitgeist/src/zeitgeist/config.log:configure:4041: cat conftest.dir/file
/var/lib/archbuild/extra-staging-with-build-support-i686/build/build/zeitgeist/src/zeitgeist/config.log:GrepMe
/var/lib/archbuild/extra-staging-with-build-support-i686/build/build/zeitgeist/src/zeitgeist/config.log:configure:4044: $? = 0
/var/lib/archbuild/extra-staging-with-build-support-i686/build/build/zeitgeist/src/zeitgeist/config.log:configure:4059: result: gnutar
/var/lib/archbuild/extra-staging-with-build-support-i686/build/build/zeitgeist/src/zeitgeist/config.log:configure:4086: checking whether to enable maintainer-specific portions of Makefiles
/var/lib/archbuild/extra-staging-with-build-support-i686/build/build/zeitgeist/src/zeitgeist/config.log:configure:4097: result: yes
/var/lib/archbuild/extra-staging-with-build-support-i686/build/build/zeitgeist/src/zeitgeist/config.log:configure:4148: checking for a Python interpreter with version >= 3
/var/lib/archbuild/extra-staging-with-build-support-i686/build/build/zeitgeist/src/zeitgeist/config.log:configure:4166: python -c import sys # split strings by '.' and convert to numeric. Append some zeros # because we need at least 4 digits for the hex conversion. # map returns an iterator in Python 3.0 and a list in 2.x minver = list(map(int, '3'.split('.'))) + [0, 0, 0] minverhex = 0 # xrange is not present in Python 3.0 and range returns an iterator for i in list(range(0, 4)): minverhex = (minverhex << 8) + minver[i] sys.exit(sys.hexversion < minverhex)
/var/lib/archbuild/extra-staging-with-build-support-i686/build/build/zeitgeist/src/zeitgeist/config.log:configure:4169: $? = 0
/var/lib/archbuild/extra-staging-with-build-support-i686/build/build/zeitgeist/src/zeitgeist/config.log:configure:4177: result: python
/var/lib/archbuild/extra-staging-with-build-support-i686/build/build/zeitgeist/src/zeitgeist/config.log:configure:4185: checking for python
/var/lib/archbuild/extra-staging-with-build-support-i686/build/build/zeitgeist/src/zeitgeist/config.log:configure:4208: found /usr/bin/python
/var/lib/archbuild/extra-staging-with-build-support-i686/build/build/zeitgeist/src/zeitgeist/config.log:configure:4221: result: /usr/bin/python
/var/lib/archbuild/extra-staging-with-build-support-i686/build/build/zeitgeist/src/zeitgeist/config.log:configure:4238: checking for python version
/var/lib/archbuild/extra-staging-with-build-support-i686/build/build/zeitgeist/src/zeitgeist/config.log:configure:4247: result: 3.13
/var/lib/archbuild/extra-staging-with-build-support-i686/build/build/zeitgeist/src/zeitgeist/config.log:configure:4252: checking for python platform
/var/lib/archbuild/extra-staging-with-build-support-i686/build/build/zeitgeist/src/zeitgeist/config.log:configure:4261: result: linux
/var/lib/archbuild/extra-staging-with-build-support-i686/build/build/zeitgeist/src/zeitgeist/config.log:configure:4324: checking for GNU default python prefix
/var/lib/archbuild/extra-staging-with-build-support-i686/build/build/zeitgeist/src/zeitgeist/config.log:configure:4326: result: ${prefix}
/var/lib/archbuild/extra-staging-with-build-support-i686/build/build/zeitgeist/src/zeitgeist/config.log:configure:4394: checking for GNU default python exec_prefix
/var/lib/archbuild/extra-staging-with-build-support-i686/build/build/zeitgeist/src/zeitgeist/config.log:configure:4396: result: ${exec_prefix}
/var/lib/archbuild/extra-staging-with-build-support-i686/build/build/zeitgeist/src/zeitgeist/config.log:configure:4443: checking for python script directory (pythondir)
/var/lib/archbuild/extra-staging-with-build-support-i686/build/build/zeitgeist/src/zeitgeist/config.log:configure:4483: result: ${PYTHON_PREFIX}/lib/python3.13/site-packages
/var/lib/archbuild/extra-staging-with-build-support-i686/build/build/zeitgeist/src/zeitgeist/config.log:configure:4491: checking for python extension module directory (pyexecdir)
/var/lib/archbuild/extra-staging-with-build-support-i686/build/build/zeitgeist/src/zeitgeist/config.log:configure:4531: result: ${PYTHON_EXEC_PREFIX}/lib/python3.13/site-packages
/var/lib/archbuild/extra-staging-with-build-support-i686/build/build/zeitgeist/src/zeitgeist/config.log:configure:4606: checking for gcc
/var/lib/archbuild/extra-staging-with-build-support-i686/build/build/zeitgeist/src/zeitgeist/config.log:configure:4627: found /usr/bin/gcc
/var/lib/archbuild/extra-staging-with-build-support-i686/build/build/zeitgeist/src/zeitgeist/config.log:configure:4639: result: gcc
/var/lib/archbuild/extra-staging-with-build-support-i686/build/build/zeitgeist/src/zeitgeist/config.log:configure:4998: checking for C compiler version
/var/lib/archbuild/extra-staging-with-build-support-i686/build/build/zeitgeist/src/zeitgeist/config.log:configure:5007: gcc --version >&5
/var/lib/archbuild/extra-staging-with-build-support-i686/build/build/zeitgeist/src/zeitgeist/config.log:gcc (GCC) 14.2.1 20250207
/var/lib/archbuild/extra-staging-with-build-support-i686/build/build/zeitgeist/src/zeitgeist/config.log:Copyright (C) 2024 Free Software Foundation, Inc.
/var/lib/archbuild/extra-staging-with-build-support-i686/build/build/zeitgeist/src/zeitgeist/config.log:This is free software; see the source for copying conditions.  There is NO
/var/lib/archbuild/extra-staging-with-build-support-i686/build/build/zeitgeist/src/zeitgeist/config.log:warranty; not even for MERCHANTABILITY or FITNESS FOR A PARTICULAR PURPOSE.
/var/lib/archbuild/extra-staging-with-build-support-i686/build/build/zeitgeist/src/zeitgeist/config.log:
/var/lib/archbuild/extra-staging-with-build-support-i686/build/build/zeitgeist/src/zeitgeist/config.log:configure:5018: $? = 0
/var/lib/archbuild/extra-staging-with-build-support-i686/build/build/zeitgeist/src/zeitgeist/config.log:configure:5007: gcc -v >&5
/var/lib/archbuild/extra-staging-with-build-support-i686/build/build/zeitgeist/src/zeitgeist/config.log:Using built-in specs.
/var/lib/archbuild/extra-staging-with-build-support-i686/build/build/zeitgeist/src/zeitgeist/config.log:COLLECT_GCC=gcc
/var/lib/archbuild/extra-staging-with-build-support-i686/build/build/zeitgeist/src/zeitgeist/config.log:COLLECT_LTO_WRAPPER=/usr/lib/gcc/i686-pc-linux-gnu/14.2.1/lto-wrapper
/var/lib/archbuild/extra-staging-with-build-support-i686/build/build/zeitgeist/src/zeitgeist/config.log:Target: i686-pc-linux-gnu
/var/lib/archbuild/extra-staging-with-build-support-i686/build/build/zeitgeist/src/zeitgeist/config.log:Configured with: /build/gcc/src/gcc/configure --enable-languages=ada,c,c++,d,fortran,go,lto,m2,objc,obj-c++,rust --enable-bootstrap --prefix=/usr --libdir=/usr/lib --libexecdir=/usr/lib --mandir=/usr/share/man --infodir=/usr/share/info --with-bugurl=https://gitlab.archlinux.org/archlinux/packaging/packages/gcc/-/issues --with-build-config=bootstrap-lto --with-linker-hash-style=gnu --with-system-zlib --enable-__cxa_atexit --disable-cet --enable-checking=release --enable-clocale=gnu --enable-default-pie --enable-default-ssp --enable-gnu-indirect-function --enable-gnu-unique-object --enable-libstdcxx-backtrace --enable-link-serialization=1 --enable-linker-build-id --enable-lto --enable-multilib --enable-plugin --enable-shared --enable-threads=posix --disable-libssp --disable-libstdcxx-pch --disable-werror --build=i686-pc-linux-gnu
/var/lib/archbuild/extra-staging-with-build-support-i686/build/build/zeitgeist/src/zeitgeist/config.log:Thread model: posix
/var/lib/archbuild/extra-staging-with-build-support-i686/build/build/zeitgeist/src/zeitgeist/config.log:Supported LTO compression algorithms: zlib zstd
/var/lib/archbuild/extra-staging-with-build-support-i686/build/build/zeitgeist/src/zeitgeist/config.log:gcc version 14.2.1 20250207 (GCC) 
/var/lib/archbuild/extra-staging-with-build-support-i686/build/build/zeitgeist/src/zeitgeist/config.log:configure:5018: $? = 0
/var/lib/archbuild/extra-staging-with-build-support-i686/build/build/zeitgeist/src/zeitgeist/config.log:configure:5007: gcc -V >&5
/var/lib/archbuild/extra-staging-with-build-support-i686/build/build/zeitgeist/src/zeitgeist/config.log:gcc: error: unrecognized command-line option '-V'
/var/lib/archbuild/extra-staging-with-build-support-i686/build/build/zeitgeist/src/zeitgeist/config.log:gcc: fatal error: no input files
/var/lib/archbuild/extra-staging-with-build-support-i686/build/build/zeitgeist/src/zeitgeist/config.log:compilation terminated.
/var/lib/archbuild/extra-staging-with-build-support-i686/build/build/zeitgeist/src/zeitgeist/config.log:configure:5018: $? = 1
/var/lib/archbuild/extra-staging-with-build-support-i686/build/build/zeitgeist/src/zeitgeist/config.log:configure:5007: gcc -qversion >&5
/var/lib/archbuild/extra-staging-with-build-support-i686/build/build/zeitgeist/src/zeitgeist/config.log:gcc: error: unrecognized command-line option '-qversion'; did you mean '--version'?
/var/lib/archbuild/extra-staging-with-build-support-i686/build/build/zeitgeist/src/zeitgeist/config.log:gcc: fatal error: no input files
/var/lib/archbuild/extra-staging-with-build-support-i686/build/build/zeitgeist/src/zeitgeist/config.log:compilation terminated.
/var/lib/archbuild/extra-staging-with-build-support-i686/build/build/zeitgeist/src/zeitgeist/config.log:configure:5018: $? = 1
/var/lib/archbuild/extra-staging-with-build-support-i686/build/build/zeitgeist/src/zeitgeist/config.log:configure:5007: gcc -version >&5
/var/lib/archbuild/extra-staging-with-build-support-i686/build/build/zeitgeist/src/zeitgeist/config.log:gcc: error: unrecognized command-line option '-version'
/var/lib/archbuild/extra-staging-with-build-support-i686/build/build/zeitgeist/src/zeitgeist/config.log:gcc: fatal error: no input files
/var/lib/archbuild/extra-staging-with-build-support-i686/build/build/zeitgeist/src/zeitgeist/config.log:compilation terminated.
/var/lib/archbuild/extra-staging-with-build-support-i686/build/build/zeitgeist/src/zeitgeist/config.log:configure:5018: $? = 1
/var/lib/archbuild/extra-staging-with-build-support-i686/build/build/zeitgeist/src/zeitgeist/config.log:configure:5038: checking whether the C compiler works
/var/lib/archbuild/extra-staging-with-build-support-i686/build/build/zeitgeist/src/zeitgeist/config.log:configure:5060: gcc -march=i686 -mtune=generic -O2 -pipe -fno-plt -fexceptions         -Wp,-D_FORTIFY_SOURCE=3 -Wformat -Werror=format-security         -fstack-clash-protection          -fno-omit-frame-pointer -mno-omit-leaf-frame-pointer -g -ffile-prefix-map=/build/zeitgeist/src=/usr/src/debug/zeitgeist -flto=auto  -Wl,-O1 -Wl,--sort-common -Wl,--as-needed -Wl,-z,relro -Wl,-z,now          -Wl,-z,pack-relative-relocs -flto=auto conftest.c  >&5
/var/lib/archbuild/extra-staging-with-build-support-i686/build/build/zeitgeist/src/zeitgeist/config.log:configure:5064: $? = 0
/var/lib/archbuild/extra-staging-with-build-support-i686/build/build/zeitgeist/src/zeitgeist/config.log:configure:5115: result: yes
/var/lib/archbuild/extra-staging-with-build-support-i686/build/build/zeitgeist/src/zeitgeist/config.log:configure:5119: checking for C compiler default output file name
/var/lib/archbuild/extra-staging-with-build-support-i686/build/build/zeitgeist/src/zeitgeist/config.log:configure:5121: result: a.out
/var/lib/archbuild/extra-staging-with-build-support-i686/build/build/zeitgeist/src/zeitgeist/config.log:configure:5127: checking for suffix of executables
/var/lib/archbuild/extra-staging-with-build-support-i686/build/build/zeitgeist/src/zeitgeist/config.log:configure:5134: gcc -o conftest -march=i686 -mtune=generic -O2 -pipe -fno-plt -fexceptions         -Wp,-D_FORTIFY_SOURCE=3 -Wformat -Werror=format-security         -fstack-clash-protection          -fno-omit-frame-pointer -mno-omit-leaf-frame-pointer -g -ffile-prefix-map=/build/zeitgeist/src=/usr/src/debug/zeitgeist -flto=auto  -Wl,-O1 -Wl,--sort-common -Wl,--as-needed -Wl,-z,relro -Wl,-z,now          -Wl,-z,pack-relative-relocs -flto=auto conftest.c  >&5
/var/lib/archbuild/extra-staging-with-build-support-i686/build/build/zeitgeist/src/zeitgeist/config.log:configure:5138: $? = 0
/var/lib/archbuild/extra-staging-with-build-support-i686/build/build/zeitgeist/src/zeitgeist/config.log:configure:5162: result: 
/var/lib/archbuild/extra-staging-with-build-support-i686/build/build/zeitgeist/src/zeitgeist/config.log:configure:5186: checking whether we are cross compiling
/var/lib/archbuild/extra-staging-with-build-support-i686/build/build/zeitgeist/src/zeitgeist/config.log:configure:5194: gcc -o conftest -march=i686 -mtune=generic -O2 -pipe -fno-plt -fexceptions         -Wp,-D_FORTIFY_SOURCE=3 -Wformat -Werror=format-security         -fstack-clash-protection          -fno-omit-frame-pointer -mno-omit-leaf-frame-pointer -g -ffile-prefix-map=/build/zeitgeist/src=/usr/src/debug/zeitgeist -flto=auto  -Wl,-O1 -Wl,--sort-common -Wl,--as-needed -Wl,-z,relro -Wl,-z,now          -Wl,-z,pack-relative-relocs -flto=auto conftest.c  >&5
/var/lib/archbuild/extra-staging-with-build-support-i686/build/build/zeitgeist/src/zeitgeist/config.log:configure:5198: $? = 0
/var/lib/archbuild/extra-staging-with-build-support-i686/build/build/zeitgeist/src/zeitgeist/config.log:configure:5205: ./conftest
/var/lib/archbuild/extra-staging-with-build-support-i686/build/build/zeitgeist/src/zeitgeist/config.log:configure:5209: $? = 0
/var/lib/archbuild/extra-staging-with-build-support-i686/build/build/zeitgeist/src/zeitgeist/config.log:configure:5224: result: no
/var/lib/archbuild/extra-staging-with-build-support-i686/build/build/zeitgeist/src/zeitgeist/config.log:configure:5230: checking for suffix of object files
/var/lib/archbuild/extra-staging-with-build-support-i686/build/build/zeitgeist/src/zeitgeist/config.log:configure:5253: gcc -c -march=i686 -mtune=generic -O2 -pipe -fno-plt -fexceptions         -Wp,-D_FORTIFY_SOURCE=3 -Wformat -Werror=format-security         -fstack-clash-protection          -fno-omit-frame-pointer -mno-omit-leaf-frame-pointer -g -ffile-prefix-map=/build/zeitgeist/src=/usr/src/debug/zeitgeist -flto=auto  conftest.c >&5
/var/lib/archbuild/extra-staging-with-build-support-i686/build/build/zeitgeist/src/zeitgeist/config.log:configure:5257: $? = 0
/var/lib/archbuild/extra-staging-with-build-support-i686/build/build/zeitgeist/src/zeitgeist/config.log:configure:5281: result: o
/var/lib/archbuild/extra-staging-with-build-support-i686/build/build/zeitgeist/src/zeitgeist/config.log:configure:5285: checking whether the compiler supports GNU C
/var/lib/archbuild/extra-staging-with-build-support-i686/build/build/zeitgeist/src/zeitgeist/config.log:configure:5305: gcc -c -march=i686 -mtune=generic -O2 -pipe -fno-plt -fexceptions         -Wp,-D_FORTIFY_SOURCE=3 -Wformat -Werror=format-security         -fstack-clash-protection          -fno-omit-frame-pointer -mno-omit-leaf-frame-pointer -g -ffile-prefix-map=/build/zeitgeist/src=/usr/src/debug/zeitgeist -flto=auto  conftest.c >&5
/var/lib/archbuild/extra-staging-with-build-support-i686/build/build/zeitgeist/src/zeitgeist/config.log:configure:5305: $? = 0
/var/lib/archbuild/extra-staging-with-build-support-i686/build/build/zeitgeist/src/zeitgeist/config.log:configure:5317: result: yes
/var/lib/archbuild/extra-staging-with-build-support-i686/build/build/zeitgeist/src/zeitgeist/config.log:configure:5328: checking whether gcc accepts -g
/var/lib/archbuild/extra-staging-with-build-support-i686/build/build/zeitgeist/src/zeitgeist/config.log:configure:5349: gcc -c -g  conftest.c >&5
/var/lib/archbuild/extra-staging-with-build-support-i686/build/build/zeitgeist/src/zeitgeist/config.log:configure:5349: $? = 0
/var/lib/archbuild/extra-staging-with-build-support-i686/build/build/zeitgeist/src/zeitgeist/config.log:configure:5396: result: yes
/var/lib/archbuild/extra-staging-with-build-support-i686/build/build/zeitgeist/src/zeitgeist/config.log:configure:5416: checking for gcc option to enable C11 features
/var/lib/archbuild/extra-staging-with-build-support-i686/build/build/zeitgeist/src/zeitgeist/config.log:configure:5431: gcc  -c -march=i686 -mtune=generic -O2 -pipe -fno-plt -fexceptions         -Wp,-D_FORTIFY_SOURCE=3 -Wformat -Werror=format-security         -fstack-clash-protection          -fno-omit-frame-pointer -mno-omit-leaf-frame-pointer -g -ffile-prefix-map=/build/zeitgeist/src=/usr/src/debug/zeitgeist -flto=auto  conftest.c >&5
/var/lib/archbuild/extra-staging-with-build-support-i686/build/build/zeitgeist/src/zeitgeist/config.log:configure:5431: $? = 0
/var/lib/archbuild/extra-staging-with-build-support-i686/build/build/zeitgeist/src/zeitgeist/config.log:configure:5450: result: none needed
/var/lib/archbuild/extra-staging-with-build-support-i686/build/build/zeitgeist/src/zeitgeist/config.log:configure:5574: checking whether gcc understands -c and -o together
/var/lib/archbuild/extra-staging-with-build-support-i686/build/build/zeitgeist/src/zeitgeist/config.log:configure:5597: gcc -c conftest.c -o conftest2.o
/var/lib/archbuild/extra-staging-with-build-support-i686/build/build/zeitgeist/src/zeitgeist/config.log:configure:5600: $? = 0
/var/lib/archbuild/extra-staging-with-build-support-i686/build/build/zeitgeist/src/zeitgeist/config.log:configure:5597: gcc -c conftest.c -o conftest2.o
/var/lib/archbuild/extra-staging-with-build-support-i686/build/build/zeitgeist/src/zeitgeist/config.log:configure:5600: $? = 0
/var/lib/archbuild/extra-staging-with-build-support-i686/build/build/zeitgeist/src/zeitgeist/config.log:configure:5613: result: yes
/var/lib/archbuild/extra-staging-with-build-support-i686/build/build/zeitgeist/src/zeitgeist/config.log:configure:5633: checking whether make supports the include directive
/var/lib/archbuild/extra-staging-with-build-support-i686/build/build/zeitgeist/src/zeitgeist/config.log:configure:5648: make -f confmf.GNU && cat confinc.out
/var/lib/archbuild/extra-staging-with-build-support-i686/build/build/zeitgeist/src/zeitgeist/config.log:this is the am__doit target
/var/lib/archbuild/extra-staging-with-build-support-i686/build/build/zeitgeist/src/zeitgeist/config.log:configure:5651: $? = 0
/var/lib/archbuild/extra-staging-with-build-support-i686/build/build/zeitgeist/src/zeitgeist/config.log:configure:5670: result: yes (GNU style)
/var/lib/archbuild/extra-staging-with-build-support-i686/build/build/zeitgeist/src/zeitgeist/config.log:configure:5696: checking dependency style of gcc
/var/lib/archbuild/extra-staging-with-build-support-i686/build/build/zeitgeist/src/zeitgeist/config.log:configure:5809: result: gcc3
/var/lib/archbuild/extra-staging-with-build-support-i686/build/build/zeitgeist/src/zeitgeist/config.log:configure:5895: checking for g++
/var/lib/archbuild/extra-staging-with-build-support-i686/build/build/zeitgeist/src/zeitgeist/config.log:configure:5916: found /usr/bin/g++
/var/lib/archbuild/extra-staging-with-build-support-i686/build/build/zeitgeist/src/zeitgeist/config.log:configure:5928: result: g++
/var/lib/archbuild/extra-staging-with-build-support-i686/build/build/zeitgeist/src/zeitgeist/config.log:configure:5955: checking for C++ compiler version
/var/lib/archbuild/extra-staging-with-build-support-i686/build/build/zeitgeist/src/zeitgeist/config.log:configure:5964: g++ --version >&5
/var/lib/archbuild/extra-staging-with-build-support-i686/build/build/zeitgeist/src/zeitgeist/config.log:g++ (GCC) 14.2.1 20250207
/var/lib/archbuild/extra-staging-with-build-support-i686/build/build/zeitgeist/src/zeitgeist/config.log:Copyright (C) 2024 Free Software Foundation, Inc.
/var/lib/archbuild/extra-staging-with-build-support-i686/build/build/zeitgeist/src/zeitgeist/config.log:This is free software; see the source for copying conditions.  There is NO
/var/lib/archbuild/extra-staging-with-build-support-i686/build/build/zeitgeist/src/zeitgeist/config.log:warranty; not even for MERCHANTABILITY or FITNESS FOR A PARTICULAR PURPOSE.
/var/lib/archbuild/extra-staging-with-build-support-i686/build/build/zeitgeist/src/zeitgeist/config.log:
/var/lib/archbuild/extra-staging-with-build-support-i686/build/build/zeitgeist/src/zeitgeist/config.log:configure:5975: $? = 0
/var/lib/archbuild/extra-staging-with-build-support-i686/build/build/zeitgeist/src/zeitgeist/config.log:configure:5964: g++ -v >&5
/var/lib/archbuild/extra-staging-with-build-support-i686/build/build/zeitgeist/src/zeitgeist/config.log:Using built-in specs.
/var/lib/archbuild/extra-staging-with-build-support-i686/build/build/zeitgeist/src/zeitgeist/config.log:COLLECT_GCC=g++
/var/lib/archbuild/extra-staging-with-build-support-i686/build/build/zeitgeist/src/zeitgeist/config.log:COLLECT_LTO_WRAPPER=/usr/lib/gcc/i686-pc-linux-gnu/14.2.1/lto-wrapper
/var/lib/archbuild/extra-staging-with-build-support-i686/build/build/zeitgeist/src/zeitgeist/config.log:Target: i686-pc-linux-gnu
/var/lib/archbuild/extra-staging-with-build-support-i686/build/build/zeitgeist/src/zeitgeist/config.log:Configured with: /build/gcc/src/gcc/configure --enable-languages=ada,c,c++,d,fortran,go,lto,m2,objc,obj-c++,rust --enable-bootstrap --prefix=/usr --libdir=/usr/lib --libexecdir=/usr/lib --mandir=/usr/share/man --infodir=/usr/share/info --with-bugurl=https://gitlab.archlinux.org/archlinux/packaging/packages/gcc/-/issues --with-build-config=bootstrap-lto --with-linker-hash-style=gnu --with-system-zlib --enable-__cxa_atexit --disable-cet --enable-checking=release --enable-clocale=gnu --enable-default-pie --enable-default-ssp --enable-gnu-indirect-function --enable-gnu-unique-object --enable-libstdcxx-backtrace --enable-link-serialization=1 --enable-linker-build-id --enable-lto --enable-multilib --enable-plugin --enable-shared --enable-threads=posix --disable-libssp --disable-libstdcxx-pch --disable-werror --build=i686-pc-linux-gnu
/var/lib/archbuild/extra-staging-with-build-support-i686/build/build/zeitgeist/src/zeitgeist/config.log:Thread model: posix
/var/lib/archbuild/extra-staging-with-build-support-i686/build/build/zeitgeist/src/zeitgeist/config.log:Supported LTO compression algorithms: zlib zstd
/var/lib/archbuild/extra-staging-with-build-support-i686/build/build/zeitgeist/src/zeitgeist/config.log:gcc version 14.2.1 20250207 (GCC) 
/var/lib/archbuild/extra-staging-with-build-support-i686/build/build/zeitgeist/src/zeitgeist/config.log:configure:5975: $? = 0
/var/lib/archbuild/extra-staging-with-build-support-i686/build/build/zeitgeist/src/zeitgeist/config.log:configure:5964: g++ -V >&5
/var/lib/archbuild/extra-staging-with-build-support-i686/build/build/zeitgeist/src/zeitgeist/config.log:g++: error: unrecognized command-line option '-V'
/var/lib/archbuild/extra-staging-with-build-support-i686/build/build/zeitgeist/src/zeitgeist/config.log:g++: fatal error: no input files
/var/lib/archbuild/extra-staging-with-build-support-i686/build/build/zeitgeist/src/zeitgeist/config.log:compilation terminated.
/var/lib/archbuild/extra-staging-with-build-support-i686/build/build/zeitgeist/src/zeitgeist/config.log:configure:5975: $? = 1
/var/lib/archbuild/extra-staging-with-build-support-i686/build/build/zeitgeist/src/zeitgeist/config.log:configure:5964: g++ -qversion >&5
/var/lib/archbuild/extra-staging-with-build-support-i686/build/build/zeitgeist/src/zeitgeist/config.log:g++: error: unrecognized command-line option '-qversion'; did you mean '--version'?
/var/lib/archbuild/extra-staging-with-build-support-i686/build/build/zeitgeist/src/zeitgeist/config.log:g++: fatal error: no input files
/var/lib/archbuild/extra-staging-with-build-support-i686/build/build/zeitgeist/src/zeitgeist/config.log:compilation terminated.
/var/lib/archbuild/extra-staging-with-build-support-i686/build/build/zeitgeist/src/zeitgeist/config.log:configure:5975: $? = 1
/var/lib/archbuild/extra-staging-with-build-support-i686/build/build/zeitgeist/src/zeitgeist/config.log:configure:5979: checking whether the compiler supports GNU C++
/var/lib/archbuild/extra-staging-with-build-support-i686/build/build/zeitgeist/src/zeitgeist/config.log:configure:5999: g++ -c -march=i686 -mtune=generic -O2 -pipe -fno-plt -fexceptions         -Wp,-D_FORTIFY_SOURCE=3 -Wformat -Werror=format-security         -fstack-clash-protection          -fno-omit-frame-pointer -mno-omit-leaf-frame-pointer -Wp,-D_GLIBCXX_ASSERTIONS -g -ffile-prefix-map=/build/zeitgeist/src=/usr/src/debug/zeitgeist -flto=auto  conftest.cpp >&5
/var/lib/archbuild/extra-staging-with-build-support-i686/build/build/zeitgeist/src/zeitgeist/config.log:configure:5999: $? = 0
/var/lib/archbuild/extra-staging-with-build-support-i686/build/build/zeitgeist/src/zeitgeist/config.log:configure:6011: result: yes
/var/lib/archbuild/extra-staging-with-build-support-i686/build/build/zeitgeist/src/zeitgeist/config.log:configure:6022: checking whether g++ accepts -g
/var/lib/archbuild/extra-staging-with-build-support-i686/build/build/zeitgeist/src/zeitgeist/config.log:configure:6043: g++ -c -g  conftest.cpp >&5
/var/lib/archbuild/extra-staging-with-build-support-i686/build/build/zeitgeist/src/zeitgeist/config.log:configure:6043: $? = 0
/var/lib/archbuild/extra-staging-with-build-support-i686/build/build/zeitgeist/src/zeitgeist/config.log:configure:6090: result: yes
/var/lib/archbuild/extra-staging-with-build-support-i686/build/build/zeitgeist/src/zeitgeist/config.log:configure:6110: checking for g++ option to enable C++11 features
/var/lib/archbuild/extra-staging-with-build-support-i686/build/build/zeitgeist/src/zeitgeist/config.log:configure:6125: g++  -c -march=i686 -mtune=generic -O2 -pipe -fno-plt -fexceptions         -Wp,-D_FORTIFY_SOURCE=3 -Wformat -Werror=format-security         -fstack-clash-protection          -fno-omit-frame-pointer -mno-omit-leaf-frame-pointer -Wp,-D_GLIBCXX_ASSERTIONS -g -ffile-prefix-map=/build/zeitgeist/src=/usr/src/debug/zeitgeist -flto=auto  conftest.cpp >&5
/var/lib/archbuild/extra-staging-with-build-support-i686/build/build/zeitgeist/src/zeitgeist/config.log:conftest.cpp: In function 'int main(int, char**)':
/var/lib/archbuild/extra-staging-with-build-support-i686/build/build/zeitgeist/src/zeitgeist/config.log:conftest.cpp:177:25: warning: empty parentheses were disambiguated as a function declaration [-Wvexing-parse]
/var/lib/archbuild/extra-staging-with-build-support-i686/build/build/zeitgeist/src/zeitgeist/config.log:  177 |   cxx11test::delegate d2();
/var/lib/archbuild/extra-staging-with-build-support-i686/build/build/zeitgeist/src/zeitgeist/config.log:      |                         ^~
/var/lib/archbuild/extra-staging-with-build-support-i686/build/build/zeitgeist/src/zeitgeist/config.log:conftest.cpp:177:25: note: remove parentheses to default-initialize a variable
/var/lib/archbuild/extra-staging-with-build-support-i686/build/build/zeitgeist/src/zeitgeist/config.log:  177 |   cxx11test::delegate d2();
/var/lib/archbuild/extra-staging-with-build-support-i686/build/build/zeitgeist/src/zeitgeist/config.log:      |                         ^~
/var/lib/archbuild/extra-staging-with-build-support-i686/build/build/zeitgeist/src/zeitgeist/config.log:      |                         --
/var/lib/archbuild/extra-staging-with-build-support-i686/build/build/zeitgeist/src/zeitgeist/config.log:conftest.cpp:177:25: note: or replace parentheses with braces to value-initialize a variable
/var/lib/archbuild/extra-staging-with-build-support-i686/build/build/zeitgeist/src/zeitgeist/config.log:configure:6125: $? = 0
/var/lib/archbuild/extra-staging-with-build-support-i686/build/build/zeitgeist/src/zeitgeist/config.log:configure:6144: result: none needed
/var/lib/archbuild/extra-staging-with-build-support-i686/build/build/zeitgeist/src/zeitgeist/config.log:configure:6215: checking dependency style of g++
/var/lib/archbuild/extra-staging-with-build-support-i686/build/build/zeitgeist/src/zeitgeist/config.log:configure:6328: result: gcc3
/var/lib/archbuild/extra-staging-with-build-support-i686/build/build/zeitgeist/src/zeitgeist/config.log:configure:6348: checking whether g++ understands -c and -o together
/var/lib/archbuild/extra-staging-with-build-support-i686/build/build/zeitgeist/src/zeitgeist/config.log:configure:6373: g++ -march=i686 -mtune=generic -O2 -pipe -fno-plt -fexceptions         -Wp,-D_FORTIFY_SOURCE=3 -Wformat -Werror=format-security         -fstack-clash-protection          -fno-omit-frame-pointer -mno-omit-leaf-frame-pointer -Wp,-D_GLIBCXX_ASSERTIONS -g -ffile-prefix-map=/build/zeitgeist/src=/usr/src/debug/zeitgeist -flto=auto -c conftest.cpp -o conftest2.o >&5
/var/lib/archbuild/extra-staging-with-build-support-i686/build/build/zeitgeist/src/zeitgeist/config.log:configure:6377: $? = 0
/var/lib/archbuild/extra-staging-with-build-support-i686/build/build/zeitgeist/src/zeitgeist/config.log:configure:6384: g++ -march=i686 -mtune=generic -O2 -pipe -fno-plt -fexceptions         -Wp,-D_FORTIFY_SOURCE=3 -Wformat -Werror=format-security         -fstack-clash-protection          -fno-omit-frame-pointer -mno-omit-leaf-frame-pointer -Wp,-D_GLIBCXX_ASSERTIONS -g -ffile-prefix-map=/build/zeitgeist/src=/usr/src/debug/zeitgeist -flto=auto -c conftest.cpp -o conftest2.o >&5
/var/lib/archbuild/extra-staging-with-build-support-i686/build/build/zeitgeist/src/zeitgeist/config.log:configure:6388: $? = 0
/var/lib/archbuild/extra-staging-with-build-support-i686/build/build/zeitgeist/src/zeitgeist/config.log:configure:6397: result: yes
/var/lib/archbuild/extra-staging-with-build-support-i686/build/build/zeitgeist/src/zeitgeist/config.log:configure:6445: checking build system type
/var/lib/archbuild/extra-staging-with-build-support-i686/build/build/zeitgeist/src/zeitgeist/config.log:configure:6461: result: i686-pc-linux-gnu
/var/lib/archbuild/extra-staging-with-build-support-i686/build/build/zeitgeist/src/zeitgeist/config.log:configure:6481: checking host system type
/var/lib/archbuild/extra-staging-with-build-support-i686/build/build/zeitgeist/src/zeitgeist/config.log:configure:6496: result: i686-pc-linux-gnu
/var/lib/archbuild/extra-staging-with-build-support-i686/build/build/zeitgeist/src/zeitgeist/config.log:configure:6537: checking how to print strings
/var/lib/archbuild/extra-staging-with-build-support-i686/build/build/zeitgeist/src/zeitgeist/config.log:configure:6564: result: printf
/var/lib/archbuild/extra-staging-with-build-support-i686/build/build/zeitgeist/src/zeitgeist/config.log:configure:6585: checking for a sed that does not truncate output
/var/lib/archbuild/extra-staging-with-build-support-i686/build/build/zeitgeist/src/zeitgeist/config.log:configure:6657: result: /usr/bin/sed
/var/lib/archbuild/extra-staging-with-build-support-i686/build/build/zeitgeist/src/zeitgeist/config.log:configure:6675: checking for grep that handles long lines and -e
/var/lib/archbuild/extra-staging-with-build-support-i686/build/build/zeitgeist/src/zeitgeist/config.log:configure:6741: result: /usr/bin/grep
/var/lib/archbuild/extra-staging-with-build-support-i686/build/build/zeitgeist/src/zeitgeist/config.log:configure:6746: checking for egrep
/var/lib/archbuild/extra-staging-with-build-support-i686/build/build/zeitgeist/src/zeitgeist/config.log:configure:6816: result: /usr/bin/grep -E
/var/lib/archbuild/extra-staging-with-build-support-i686/build/build/zeitgeist/src/zeitgeist/config.log:configure:6823: checking for fgrep
/var/lib/archbuild/extra-staging-with-build-support-i686/build/build/zeitgeist/src/zeitgeist/config.log:configure:6893: result: /usr/bin/grep -F
/var/lib/archbuild/extra-staging-with-build-support-i686/build/build/zeitgeist/src/zeitgeist/config.log:configure:6930: checking for ld used by gcc
/var/lib/archbuild/extra-staging-with-build-support-i686/build/build/zeitgeist/src/zeitgeist/config.log:configure:6999: result: /usr/bin/ld
/var/lib/archbuild/extra-staging-with-build-support-i686/build/build/zeitgeist/src/zeitgeist/config.log:configure:7006: checking if the linker (/usr/bin/ld) is GNU ld
/var/lib/archbuild/extra-staging-with-build-support-i686/build/build/zeitgeist/src/zeitgeist/config.log:configure:7023: result: yes
/var/lib/archbuild/extra-staging-with-build-support-i686/build/build/zeitgeist/src/zeitgeist/config.log:configure:7035: checking for BSD- or MS-compatible name lister (nm)
/var/lib/archbuild/extra-staging-with-build-support-i686/build/build/zeitgeist/src/zeitgeist/config.log:configure:7091: result: /usr/bin/nm -B
/var/lib/archbuild/extra-staging-with-build-support-i686/build/build/zeitgeist/src/zeitgeist/config.log:configure:7233: checking the name lister (/usr/bin/nm -B) interface
/var/lib/archbuild/extra-staging-with-build-support-i686/build/build/zeitgeist/src/zeitgeist/config.log:configure:7241: gcc -c -march=i686 -mtune=generic -O2 -pipe -fno-plt -fexceptions         -Wp,-D_FORTIFY_SOURCE=3 -Wformat -Werror=format-security         -fstack-clash-protection          -fno-omit-frame-pointer -mno-omit-leaf-frame-pointer -g -ffile-prefix-map=/build/zeitgeist/src=/usr/src/debug/zeitgeist -flto=auto  conftest.c >&5
/var/lib/archbuild/extra-staging-with-build-support-i686/build/build/zeitgeist/src/zeitgeist/config.log:configure:7244: /usr/bin/nm -B "conftest.o"
/var/lib/archbuild/extra-staging-with-build-support-i686/build/build/zeitgeist/src/zeitgeist/config.log:configure:7247: output
/var/lib/archbuild/extra-staging-with-build-support-i686/build/build/zeitgeist/src/zeitgeist/config.log:00000000 B some_variable
/var/lib/archbuild/extra-staging-with-build-support-i686/build/build/zeitgeist/src/zeitgeist/config.log:configure:7255: result: BSD nm
/var/lib/archbuild/extra-staging-with-build-support-i686/build/build/zeitgeist/src/zeitgeist/config.log:configure:7258: checking whether ln -s works
/var/lib/archbuild/extra-staging-with-build-support-i686/build/build/zeitgeist/src/zeitgeist/config.log:configure:7262: result: yes
/var/lib/archbuild/extra-staging-with-build-support-i686/build/build/zeitgeist/src/zeitgeist/config.log:configure:7270: checking the maximum length of command line arguments
/var/lib/archbuild/extra-staging-with-build-support-i686/build/build/zeitgeist/src/zeitgeist/config.log:configure:7403: result: 1572864
/var/lib/archbuild/extra-staging-with-build-support-i686/build/build/zeitgeist/src/zeitgeist/config.log:configure:7451: checking how to convert i686-pc-linux-gnu file names to i686-pc-linux-gnu format
/var/lib/archbuild/extra-staging-with-build-support-i686/build/build/zeitgeist/src/zeitgeist/config.log:configure:7493: result: func_convert_file_noop
/var/lib/archbuild/extra-staging-with-build-support-i686/build/build/zeitgeist/src/zeitgeist/config.log:configure:7500: checking how to convert i686-pc-linux-gnu file names to toolchain format
/var/lib/archbuild/extra-staging-with-build-support-i686/build/build/zeitgeist/src/zeitgeist/config.log:configure:7522: result: func_convert_file_noop
/var/lib/archbuild/extra-staging-with-build-support-i686/build/build/zeitgeist/src/zeitgeist/config.log:configure:7529: checking for /usr/bin/ld option to reload object files
/var/lib/archbuild/extra-staging-with-build-support-i686/build/build/zeitgeist/src/zeitgeist/config.log:configure:7538: result: -r
/var/lib/archbuild/extra-staging-with-build-support-i686/build/build/zeitgeist/src/zeitgeist/config.log:configure:7571: checking for file
/var/lib/archbuild/extra-staging-with-build-support-i686/build/build/zeitgeist/src/zeitgeist/config.log:configure:7592: found /usr/bin/file
/var/lib/archbuild/extra-staging-with-build-support-i686/build/build/zeitgeist/src/zeitgeist/config.log:configure:7605: result: file
/var/lib/archbuild/extra-staging-with-build-support-i686/build/build/zeitgeist/src/zeitgeist/config.log:configure:7668: checking for objdump
/var/lib/archbuild/extra-staging-with-build-support-i686/build/build/zeitgeist/src/zeitgeist/config.log:configure:7689: found /usr/bin/objdump
/var/lib/archbuild/extra-staging-with-build-support-i686/build/build/zeitgeist/src/zeitgeist/config.log:configure:7701: result: objdump
/var/lib/archbuild/extra-staging-with-build-support-i686/build/build/zeitgeist/src/zeitgeist/config.log:configure:7733: checking how to recognize dependent libraries
/var/lib/archbuild/extra-staging-with-build-support-i686/build/build/zeitgeist/src/zeitgeist/config.log:configure:7942: result: pass_all
/var/lib/archbuild/extra-staging-with-build-support-i686/build/build/zeitgeist/src/zeitgeist/config.log:configure:8033: checking for dlltool
/var/lib/archbuild/extra-staging-with-build-support-i686/build/build/zeitgeist/src/zeitgeist/config.log:configure:8069: result: no
/var/lib/archbuild/extra-staging-with-build-support-i686/build/build/zeitgeist/src/zeitgeist/config.log:configure:8099: checking how to associate runtime and link libraries
/var/lib/archbuild/extra-staging-with-build-support-i686/build/build/zeitgeist/src/zeitgeist/config.log:configure:8128: result: printf %s\n
/var/lib/archbuild/extra-staging-with-build-support-i686/build/build/zeitgeist/src/zeitgeist/config.log:configure:8189: checking for ranlib
/var/lib/archbuild/extra-staging-with-build-support-i686/build/build/zeitgeist/src/zeitgeist/config.log:configure:8210: found /usr/bin/ranlib
/var/lib/archbuild/extra-staging-with-build-support-i686/build/build/zeitgeist/src/zeitgeist/config.log:configure:8222: result: ranlib
/var/lib/archbuild/extra-staging-with-build-support-i686/build/build/zeitgeist/src/zeitgeist/config.log:configure:8299: checking for ar
/var/lib/archbuild/extra-staging-with-build-support-i686/build/build/zeitgeist/src/zeitgeist/config.log:configure:8320: found /usr/bin/ar
/var/lib/archbuild/extra-staging-with-build-support-i686/build/build/zeitgeist/src/zeitgeist/config.log:configure:8332: result: ar
/var/lib/archbuild/extra-staging-with-build-support-i686/build/build/zeitgeist/src/zeitgeist/config.log:configure:8385: checking for archiver @FILE support
/var/lib/archbuild/extra-staging-with-build-support-i686/build/build/zeitgeist/src/zeitgeist/config.log:configure:8403: gcc -c -march=i686 -mtune=generic -O2 -pipe -fno-plt -fexceptions         -Wp,-D_FORTIFY_SOURCE=3 -Wformat -Werror=format-security         -fstack-clash-protection          -fno-omit-frame-pointer -mno-omit-leaf-frame-pointer -g -ffile-prefix-map=/build/zeitgeist/src=/usr/src/debug/zeitgeist -flto=auto  conftest.c >&5
/var/lib/archbuild/extra-staging-with-build-support-i686/build/build/zeitgeist/src/zeitgeist/config.log:configure:8403: $? = 0
/var/lib/archbuild/extra-staging-with-build-support-i686/build/build/zeitgeist/src/zeitgeist/config.log:configure:8407: ar cr libconftest.a @conftest.lst >&5
/var/lib/archbuild/extra-staging-with-build-support-i686/build/build/zeitgeist/src/zeitgeist/config.log:configure:8410: $? = 0
/var/lib/archbuild/extra-staging-with-build-support-i686/build/build/zeitgeist/src/zeitgeist/config.log:configure:8415: ar cr libconftest.a @conftest.lst >&5
/var/lib/archbuild/extra-staging-with-build-support-i686/build/build/zeitgeist/src/zeitgeist/config.log:ar: conftest.o: No such file or directory
/var/lib/archbuild/extra-staging-with-build-support-i686/build/build/zeitgeist/src/zeitgeist/config.log:configure:8418: $? = 1
/var/lib/archbuild/extra-staging-with-build-support-i686/build/build/zeitgeist/src/zeitgeist/config.log:configure:8431: result: @
/var/lib/archbuild/extra-staging-with-build-support-i686/build/build/zeitgeist/src/zeitgeist/config.log:configure:8495: checking for strip
/var/lib/archbuild/extra-staging-with-build-support-i686/build/build/zeitgeist/src/zeitgeist/config.log:configure:8516: found /usr/bin/strip
/var/lib/archbuild/extra-staging-with-build-support-i686/build/build/zeitgeist/src/zeitgeist/config.log:configure:8528: result: strip
/var/lib/archbuild/extra-staging-with-build-support-i686/build/build/zeitgeist/src/zeitgeist/config.log:configure:8631: checking command to parse /usr/bin/nm -B output from gcc object
/var/lib/archbuild/extra-staging-with-build-support-i686/build/build/zeitgeist/src/zeitgeist/config.log:configure:8785: gcc -c -march=i686 -mtune=generic -O2 -pipe -fno-plt -fexceptions         -Wp,-D_FORTIFY_SOURCE=3 -Wformat -Werror=format-security         -fstack-clash-protection          -fno-omit-frame-pointer -mno-omit-leaf-frame-pointer -g -ffile-prefix-map=/build/zeitgeist/src=/usr/src/debug/zeitgeist -flto=auto  conftest.c >&5
/var/lib/archbuild/extra-staging-with-build-support-i686/build/build/zeitgeist/src/zeitgeist/config.log:configure:8788: $? = 0
/var/lib/archbuild/extra-staging-with-build-support-i686/build/build/zeitgeist/src/zeitgeist/config.log:configure:8792: /usr/bin/nm -B conftest.o | /usr/bin/sed -n -e 's/^.*[	 ]\([ABCDGIRSTW][ABCDGIRSTW]*\)[	 ][	 ]*\([_A-Za-z][_A-Za-z0-9]*\)$/\1 \2 \2/p' | /usr/bin/sed '/ __gnu_lto/d' > conftest.nm
/var/lib/archbuild/extra-staging-with-build-support-i686/build/build/zeitgeist/src/zeitgeist/config.log:configure:8858: gcc -o conftest -march=i686 -mtune=generic -O2 -pipe -fno-plt -fexceptions         -Wp,-D_FORTIFY_SOURCE=3 -Wformat -Werror=format-security         -fstack-clash-protection          -fno-omit-frame-pointer -mno-omit-leaf-frame-pointer -g -ffile-prefix-map=/build/zeitgeist/src=/usr/src/debug/zeitgeist -flto=auto  -Wl,-O1 -Wl,--sort-common -Wl,--as-needed -Wl,-z,relro -Wl,-z,now          -Wl,-z,pack-relative-relocs -flto=auto conftest.c conftstm.o >&5
/var/lib/archbuild/extra-staging-with-build-support-i686/build/build/zeitgeist/src/zeitgeist/config.log:configure:8861: $? = 0
/var/lib/archbuild/extra-staging-with-build-support-i686/build/build/zeitgeist/src/zeitgeist/config.log:configure:8900: result: ok
/var/lib/archbuild/extra-staging-with-build-support-i686/build/build/zeitgeist/src/zeitgeist/config.log:configure:8947: checking for sysroot
/var/lib/archbuild/extra-staging-with-build-support-i686/build/build/zeitgeist/src/zeitgeist/config.log:configure:8981: result: no
/var/lib/archbuild/extra-staging-with-build-support-i686/build/build/zeitgeist/src/zeitgeist/config.log:configure:8988: checking for a working dd
/var/lib/archbuild/extra-staging-with-build-support-i686/build/build/zeitgeist/src/zeitgeist/config.log:configure:9033: result: /usr/bin/dd
/var/lib/archbuild/extra-staging-with-build-support-i686/build/build/zeitgeist/src/zeitgeist/config.log:configure:9037: checking how to truncate binary pipes
/var/lib/archbuild/extra-staging-with-build-support-i686/build/build/zeitgeist/src/zeitgeist/config.log:configure:9054: result: /usr/bin/dd bs=4096 count=1
/var/lib/archbuild/extra-staging-with-build-support-i686/build/build/zeitgeist/src/zeitgeist/config.log:configure:9394: checking for mt
/var/lib/archbuild/extra-staging-with-build-support-i686/build/build/zeitgeist/src/zeitgeist/config.log:configure:9430: result: no
/var/lib/archbuild/extra-staging-with-build-support-i686/build/build/zeitgeist/src/zeitgeist/config.log:configure:9450: checking if : is a manifest tool
/var/lib/archbuild/extra-staging-with-build-support-i686/build/build/zeitgeist/src/zeitgeist/config.log:configure:9457: : '-?'
/var/lib/archbuild/extra-staging-with-build-support-i686/build/build/zeitgeist/src/zeitgeist/config.log:configure:9466: result: no
/var/lib/archbuild/extra-staging-with-build-support-i686/build/build/zeitgeist/src/zeitgeist/config.log:configure:10263: checking for stdio.h
/var/lib/archbuild/extra-staging-with-build-support-i686/build/build/zeitgeist/src/zeitgeist/config.log:configure:10263: gcc -c -march=i686 -mtune=generic -O2 -pipe -fno-plt -fexceptions         -Wp,-D_FORTIFY_SOURCE=3 -Wformat -Werror=format-security         -fstack-clash-protection          -fno-omit-frame-pointer -mno-omit-leaf-frame-pointer -g -ffile-prefix-map=/build/zeitgeist/src=/usr/src/debug/zeitgeist -flto=auto  conftest.c >&5
/var/lib/archbuild/extra-staging-with-build-support-i686/build/build/zeitgeist/src/zeitgeist/config.log:configure:10263: $? = 0
/var/lib/archbuild/extra-staging-with-build-support-i686/build/build/zeitgeist/src/zeitgeist/config.log:configure:10263: result: yes
/var/lib/archbuild/extra-staging-with-build-support-i686/build/build/zeitgeist/src/zeitgeist/config.log:configure:10263: checking for stdlib.h
/var/lib/archbuild/extra-staging-with-build-support-i686/build/build/zeitgeist/src/zeitgeist/config.log:configure:10263: gcc -c -march=i686 -mtune=generic -O2 -pipe -fno-plt -fexceptions         -Wp,-D_FORTIFY_SOURCE=3 -Wformat -Werror=format-security         -fstack-clash-protection          -fno-omit-frame-pointer -mno-omit-leaf-frame-pointer -g -ffile-prefix-map=/build/zeitgeist/src=/usr/src/debug/zeitgeist -flto=auto  conftest.c >&5
/var/lib/archbuild/extra-staging-with-build-support-i686/build/build/zeitgeist/src/zeitgeist/config.log:configure:10263: $? = 0
/var/lib/archbuild/extra-staging-with-build-support-i686/build/build/zeitgeist/src/zeitgeist/config.log:configure:10263: result: yes
/var/lib/archbuild/extra-staging-with-build-support-i686/build/build/zeitgeist/src/zeitgeist/config.log:configure:10263: checking for string.h
/var/lib/archbuild/extra-staging-with-build-support-i686/build/build/zeitgeist/src/zeitgeist/config.log:configure:10263: gcc -c -march=i686 -mtune=generic -O2 -pipe -fno-plt -fexceptions         -Wp,-D_FORTIFY_SOURCE=3 -Wformat -Werror=format-security         -fstack-clash-protection          -fno-omit-frame-pointer -mno-omit-leaf-frame-pointer -g -ffile-prefix-map=/build/zeitgeist/src=/usr/src/debug/zeitgeist -flto=auto  conftest.c >&5
/var/lib/archbuild/extra-staging-with-build-support-i686/build/build/zeitgeist/src/zeitgeist/config.log:configure:10263: $? = 0
/var/lib/archbuild/extra-staging-with-build-support-i686/build/build/zeitgeist/src/zeitgeist/config.log:configure:10263: result: yes
/var/lib/archbuild/extra-staging-with-build-support-i686/build/build/zeitgeist/src/zeitgeist/config.log:configure:10263: checking for inttypes.h
/var/lib/archbuild/extra-staging-with-build-support-i686/build/build/zeitgeist/src/zeitgeist/config.log:configure:10263: gcc -c -march=i686 -mtune=generic -O2 -pipe -fno-plt -fexceptions         -Wp,-D_FORTIFY_SOURCE=3 -Wformat -Werror=format-security         -fstack-clash-protection          -fno-omit-frame-pointer -mno-omit-leaf-frame-pointer -g -ffile-prefix-map=/build/zeitgeist/src=/usr/src/debug/zeitgeist -flto=auto  conftest.c >&5
/var/lib/archbuild/extra-staging-with-build-support-i686/build/build/zeitgeist/src/zeitgeist/config.log:configure:10263: $? = 0
/var/lib/archbuild/extra-staging-with-build-support-i686/build/build/zeitgeist/src/zeitgeist/config.log:configure:10263: result: yes
/var/lib/archbuild/extra-staging-with-build-support-i686/build/build/zeitgeist/src/zeitgeist/config.log:configure:10263: checking for stdint.h
/var/lib/archbuild/extra-staging-with-build-support-i686/build/build/zeitgeist/src/zeitgeist/config.log:configure:10263: gcc -c -march=i686 -mtune=generic -O2 -pipe -fno-plt -fexceptions         -Wp,-D_FORTIFY_SOURCE=3 -Wformat -Werror=format-security         -fstack-clash-protection          -fno-omit-frame-pointer -mno-omit-leaf-frame-pointer -g -ffile-prefix-map=/build/zeitgeist/src=/usr/src/debug/zeitgeist -flto=auto  conftest.c >&5
/var/lib/archbuild/extra-staging-with-build-support-i686/build/build/zeitgeist/src/zeitgeist/config.log:configure:10263: $? = 0
/var/lib/archbuild/extra-staging-with-build-support-i686/build/build/zeitgeist/src/zeitgeist/config.log:configure:10263: result: yes
/var/lib/archbuild/extra-staging-with-build-support-i686/build/build/zeitgeist/src/zeitgeist/config.log:configure:10263: checking for strings.h
/var/lib/archbuild/extra-staging-with-build-support-i686/build/build/zeitgeist/src/zeitgeist/config.log:configure:10263: gcc -c -march=i686 -mtune=generic -O2 -pipe -fno-plt -fexceptions         -Wp,-D_FORTIFY_SOURCE=3 -Wformat -Werror=format-security         -fstack-clash-protection          -fno-omit-frame-pointer -mno-omit-leaf-frame-pointer -g -ffile-prefix-map=/build/zeitgeist/src=/usr/src/debug/zeitgeist -flto=auto  conftest.c >&5
/var/lib/archbuild/extra-staging-with-build-support-i686/build/build/zeitgeist/src/zeitgeist/config.log:configure:10263: $? = 0
/var/lib/archbuild/extra-staging-with-build-support-i686/build/build/zeitgeist/src/zeitgeist/config.log:configure:10263: result: yes
/var/lib/archbuild/extra-staging-with-build-support-i686/build/build/zeitgeist/src/zeitgeist/config.log:configure:10263: checking for sys/stat.h
/var/lib/archbuild/extra-staging-with-build-support-i686/build/build/zeitgeist/src/zeitgeist/config.log:configure:10263: gcc -c -march=i686 -mtune=generic -O2 -pipe -fno-plt -fexceptions         -Wp,-D_FORTIFY_SOURCE=3 -Wformat -Werror=format-security         -fstack-clash-protection          -fno-omit-frame-pointer -mno-omit-leaf-frame-pointer -g -ffile-prefix-map=/build/zeitgeist/src=/usr/src/debug/zeitgeist -flto=auto  conftest.c >&5
/var/lib/archbuild/extra-staging-with-build-support-i686/build/build/zeitgeist/src/zeitgeist/config.log:configure:10263: $? = 0
/var/lib/archbuild/extra-staging-with-build-support-i686/build/build/zeitgeist/src/zeitgeist/config.log:configure:10263: result: yes
/var/lib/archbuild/extra-staging-with-build-support-i686/build/build/zeitgeist/src/zeitgeist/config.log:configure:10263: checking for sys/types.h
/var/lib/archbuild/extra-staging-with-build-support-i686/build/build/zeitgeist/src/zeitgeist/config.log:configure:10263: gcc -c -march=i686 -mtune=generic -O2 -pipe -fno-plt -fexceptions         -Wp,-D_FORTIFY_SOURCE=3 -Wformat -Werror=format-security         -fstack-clash-protection          -fno-omit-frame-pointer -mno-omit-leaf-frame-pointer -g -ffile-prefix-map=/build/zeitgeist/src=/usr/src/debug/zeitgeist -flto=auto  conftest.c >&5
/var/lib/archbuild/extra-staging-with-build-support-i686/build/build/zeitgeist/src/zeitgeist/config.log:configure:10263: $? = 0
/var/lib/archbuild/extra-staging-with-build-support-i686/build/build/zeitgeist/src/zeitgeist/config.log:configure:10263: result: yes
/var/lib/archbuild/extra-staging-with-build-support-i686/build/build/zeitgeist/src/zeitgeist/config.log:configure:10263: checking for unistd.h
/var/lib/archbuild/extra-staging-with-build-support-i686/build/build/zeitgeist/src/zeitgeist/config.log:configure:10263: gcc -c -march=i686 -mtune=generic -O2 -pipe -fno-plt -fexceptions         -Wp,-D_FORTIFY_SOURCE=3 -Wformat -Werror=format-security         -fstack-clash-protection          -fno-omit-frame-pointer -mno-omit-leaf-frame-pointer -g -ffile-prefix-map=/build/zeitgeist/src=/usr/src/debug/zeitgeist -flto=auto  conftest.c >&5
/var/lib/archbuild/extra-staging-with-build-support-i686/build/build/zeitgeist/src/zeitgeist/config.log:configure:10263: $? = 0
/var/lib/archbuild/extra-staging-with-build-support-i686/build/build/zeitgeist/src/zeitgeist/config.log:configure:10263: result: yes
/var/lib/archbuild/extra-staging-with-build-support-i686/build/build/zeitgeist/src/zeitgeist/config.log:configure:10288: checking for dlfcn.h
/var/lib/archbuild/extra-staging-with-build-support-i686/build/build/zeitgeist/src/zeitgeist/config.log:configure:10288: gcc -c -march=i686 -mtune=generic -O2 -pipe -fno-plt -fexceptions         -Wp,-D_FORTIFY_SOURCE=3 -Wformat -Werror=format-security         -fstack-clash-protection          -fno-omit-frame-pointer -mno-omit-leaf-frame-pointer -g -ffile-prefix-map=/build/zeitgeist/src=/usr/src/debug/zeitgeist -flto=auto  conftest.c >&5
/var/lib/archbuild/extra-staging-with-build-support-i686/build/build/zeitgeist/src/zeitgeist/config.log:configure:10288: $? = 0
/var/lib/archbuild/extra-staging-with-build-support-i686/build/build/zeitgeist/src/zeitgeist/config.log:configure:10288: result: yes
/var/lib/archbuild/extra-staging-with-build-support-i686/build/build/zeitgeist/src/zeitgeist/config.log:configure:10601: checking for objdir
/var/lib/archbuild/extra-staging-with-build-support-i686/build/build/zeitgeist/src/zeitgeist/config.log:configure:10618: result: .libs
/var/lib/archbuild/extra-staging-with-build-support-i686/build/build/zeitgeist/src/zeitgeist/config.log:configure:10884: checking if gcc supports -fno-rtti -fno-exceptions
/var/lib/archbuild/extra-staging-with-build-support-i686/build/build/zeitgeist/src/zeitgeist/config.log:configure:10903: gcc -c -march=i686 -mtune=generic -O2 -pipe -fno-plt -fexceptions         -Wp,-D_FORTIFY_SOURCE=3 -Wformat -Werror=format-security         -fstack-clash-protection          -fno-omit-frame-pointer -mno-omit-leaf-frame-pointer -g -ffile-prefix-map=/build/zeitgeist/src=/usr/src/debug/zeitgeist -flto=auto  -fno-rtti -fno-exceptions conftest.c >&5
/var/lib/archbuild/extra-staging-with-build-support-i686/build/build/zeitgeist/src/zeitgeist/config.log:cc1: warning: command-line option '-fno-rtti' is valid for C++/D/ObjC++ but not for C
/var/lib/archbuild/extra-staging-with-build-support-i686/build/build/zeitgeist/src/zeitgeist/config.log:configure:10907: $? = 0
/var/lib/archbuild/extra-staging-with-build-support-i686/build/build/zeitgeist/src/zeitgeist/config.log:configure:10921: result: no
/var/lib/archbuild/extra-staging-with-build-support-i686/build/build/zeitgeist/src/zeitgeist/config.log:configure:11294: checking for gcc option to produce PIC
/var/lib/archbuild/extra-staging-with-build-support-i686/build/build/zeitgeist/src/zeitgeist/config.log:configure:11303: result: -fPIC -DPIC
/var/lib/archbuild/extra-staging-with-build-support-i686/build/build/zeitgeist/src/zeitgeist/config.log:configure:11311: checking if gcc PIC flag -fPIC -DPIC works
/var/lib/archbuild/extra-staging-with-build-support-i686/build/build/zeitgeist/src/zeitgeist/config.log:configure:11330: gcc -c -march=i686 -mtune=generic -O2 -pipe -fno-plt -fexceptions         -Wp,-D_FORTIFY_SOURCE=3 -Wformat -Werror=format-security         -fstack-clash-protection          -fno-omit-frame-pointer -mno-omit-leaf-frame-pointer -g -ffile-prefix-map=/build/zeitgeist/src=/usr/src/debug/zeitgeist -flto=auto  -fPIC -DPIC -DPIC conftest.c >&5
/var/lib/archbuild/extra-staging-with-build-support-i686/build/build/zeitgeist/src/zeitgeist/config.log:configure:11334: $? = 0
/var/lib/archbuild/extra-staging-with-build-support-i686/build/build/zeitgeist/src/zeitgeist/config.log:configure:11348: result: yes
/var/lib/archbuild/extra-staging-with-build-support-i686/build/build/zeitgeist/src/zeitgeist/config.log:configure:11377: checking if gcc static flag -static works
/var/lib/archbuild/extra-staging-with-build-support-i686/build/build/zeitgeist/src/zeitgeist/config.log:configure:11407: result: yes
/var/lib/archbuild/extra-staging-with-build-support-i686/build/build/zeitgeist/src/zeitgeist/config.log:configure:11422: checking if gcc supports -c -o file.o
/var/lib/archbuild/extra-staging-with-build-support-i686/build/build/zeitgeist/src/zeitgeist/config.log:configure:11444: gcc -c -march=i686 -mtune=generic -O2 -pipe -fno-plt -fexceptions         -Wp,-D_FORTIFY_SOURCE=3 -Wformat -Werror=format-security         -fstack-clash-protection          -fno-omit-frame-pointer -mno-omit-leaf-frame-pointer -g -ffile-prefix-map=/build/zeitgeist/src=/usr/src/debug/zeitgeist -flto=auto  -o out/conftest2.o conftest.c >&5
/var/lib/archbuild/extra-staging-with-build-support-i686/build/build/zeitgeist/src/zeitgeist/config.log:configure:11448: $? = 0
/var/lib/archbuild/extra-staging-with-build-support-i686/build/build/zeitgeist/src/zeitgeist/config.log:configure:11471: result: yes
/var/lib/archbuild/extra-staging-with-build-support-i686/build/build/zeitgeist/src/zeitgeist/config.log:configure:11479: checking if gcc supports -c -o file.o
/var/lib/archbuild/extra-staging-with-build-support-i686/build/build/zeitgeist/src/zeitgeist/config.log:configure:11528: result: yes
/var/lib/archbuild/extra-staging-with-build-support-i686/build/build/zeitgeist/src/zeitgeist/config.log:configure:11561: checking whether the gcc linker (/usr/bin/ld) supports shared libraries
/var/lib/archbuild/extra-staging-with-build-support-i686/build/build/zeitgeist/src/zeitgeist/config.log:configure:12845: result: yes
/var/lib/archbuild/extra-staging-with-build-support-i686/build/build/zeitgeist/src/zeitgeist/config.log:configure:12882: checking whether -lc should be explicitly linked in
/var/lib/archbuild/extra-staging-with-build-support-i686/build/build/zeitgeist/src/zeitgeist/config.log:configure:12891: gcc -c -march=i686 -mtune=generic -O2 -pipe -fno-plt -fexceptions         -Wp,-D_FORTIFY_SOURCE=3 -Wformat -Werror=format-security         -fstack-clash-protection          -fno-omit-frame-pointer -mno-omit-leaf-frame-pointer -g -ffile-prefix-map=/build/zeitgeist/src=/usr/src/debug/zeitgeist -flto=auto  conftest.c >&5
/var/lib/archbuild/extra-staging-with-build-support-i686/build/build/zeitgeist/src/zeitgeist/config.log:configure:12894: $? = 0
/var/lib/archbuild/extra-staging-with-build-support-i686/build/build/zeitgeist/src/zeitgeist/config.log:configure:12909: gcc -shared  -fPIC -DPIC conftest.o  -v -Wl,-soname -Wl,conftest -o conftest 2\>\&1 \| /usr/bin/grep  -lc  \>/dev/null 2\>\&1
/var/lib/archbuild/extra-staging-with-build-support-i686/build/build/zeitgeist/src/zeitgeist/config.log:configure:12912: $? = 0
/var/lib/archbuild/extra-staging-with-build-support-i686/build/build/zeitgeist/src/zeitgeist/config.log:configure:12927: result: no
/var/lib/archbuild/extra-staging-with-build-support-i686/build/build/zeitgeist/src/zeitgeist/config.log:configure:13087: checking dynamic linker characteristics
/var/lib/archbuild/extra-staging-with-build-support-i686/build/build/zeitgeist/src/zeitgeist/config.log:configure:13706: gcc -o conftest -march=i686 -mtune=generic -O2 -pipe -fno-plt -fexceptions         -Wp,-D_FORTIFY_SOURCE=3 -Wformat -Werror=format-security         -fstack-clash-protection          -fno-omit-frame-pointer -mno-omit-leaf-frame-pointer -g -ffile-prefix-map=/build/zeitgeist/src=/usr/src/debug/zeitgeist -flto=auto  -Wl,-O1 -Wl,--sort-common -Wl,--as-needed -Wl,-z,relro -Wl,-z,now          -Wl,-z,pack-relative-relocs -flto=auto -Wl,-rpath -Wl,/foo conftest.c  >&5
/var/lib/archbuild/extra-staging-with-build-support-i686/build/build/zeitgeist/src/zeitgeist/config.log:configure:13706: $? = 0
/var/lib/archbuild/extra-staging-with-build-support-i686/build/build/zeitgeist/src/zeitgeist/config.log:configure:14471: result: GNU/Linux ld.so
/var/lib/archbuild/extra-staging-with-build-support-i686/build/build/zeitgeist/src/zeitgeist/config.log:configure:14593: checking how to hardcode library paths into programs
/var/lib/archbuild/extra-staging-with-build-support-i686/build/build/zeitgeist/src/zeitgeist/config.log:configure:14618: result: immediate
/var/lib/archbuild/extra-staging-with-build-support-i686/build/build/zeitgeist/src/zeitgeist/config.log:configure:15218: checking whether stripping libraries is possible
/var/lib/archbuild/extra-staging-with-build-support-i686/build/build/zeitgeist/src/zeitgeist/config.log:configure:15227: result: yes
/var/lib/archbuild/extra-staging-with-build-support-i686/build/build/zeitgeist/src/zeitgeist/config.log:configure:15269: checking if libtool supports shared libraries
/var/lib/archbuild/extra-staging-with-build-support-i686/build/build/zeitgeist/src/zeitgeist/config.log:configure:15271: result: yes
/var/lib/archbuild/extra-staging-with-build-support-i686/build/build/zeitgeist/src/zeitgeist/config.log:configure:15274: checking whether to build shared libraries
/var/lib/archbuild/extra-staging-with-build-support-i686/build/build/zeitgeist/src/zeitgeist/config.log:configure:15299: result: yes
/var/lib/archbuild/extra-staging-with-build-support-i686/build/build/zeitgeist/src/zeitgeist/config.log:configure:15302: checking whether to build static libraries
/var/lib/archbuild/extra-staging-with-build-support-i686/build/build/zeitgeist/src/zeitgeist/config.log:configure:15306: result: no
/var/lib/archbuild/extra-staging-with-build-support-i686/build/build/zeitgeist/src/zeitgeist/config.log:configure:15329: checking how to run the C++ preprocessor
/var/lib/archbuild/extra-staging-with-build-support-i686/build/build/zeitgeist/src/zeitgeist/config.log:configure:15351: g++ -E  conftest.cpp
/var/lib/archbuild/extra-staging-with-build-support-i686/build/build/zeitgeist/src/zeitgeist/config.log:configure:15351: $? = 0
/var/lib/archbuild/extra-staging-with-build-support-i686/build/build/zeitgeist/src/zeitgeist/config.log:configure:15367: g++ -E  conftest.cpp
/var/lib/archbuild/extra-staging-with-build-support-i686/build/build/zeitgeist/src/zeitgeist/config.log:conftest.cpp:23:10: fatal error: ac_nonexistent.h: No such file or directory
/var/lib/archbuild/extra-staging-with-build-support-i686/build/build/zeitgeist/src/zeitgeist/config.log:   23 | #include <ac_nonexistent.h>
/var/lib/archbuild/extra-staging-with-build-support-i686/build/build/zeitgeist/src/zeitgeist/config.log:      |          ^~~~~~~~~~~~~~~~~~
/var/lib/archbuild/extra-staging-with-build-support-i686/build/build/zeitgeist/src/zeitgeist/config.log:compilation terminated.
/var/lib/archbuild/extra-staging-with-build-support-i686/build/build/zeitgeist/src/zeitgeist/config.log:configure:15367: $? = 1
/var/lib/archbuild/extra-staging-with-build-support-i686/build/build/zeitgeist/src/zeitgeist/config.log:configure: failed program was:
/var/lib/archbuild/extra-staging-with-build-support-i686/build/build/zeitgeist/src/zeitgeist/config.log:| /* confdefs.h */
/var/lib/archbuild/extra-staging-with-build-support-i686/build/build/zeitgeist/src/zeitgeist/config.log:| #define PACKAGE_NAME "zeitgeist"
/var/lib/archbuild/extra-staging-with-build-support-i686/build/build/zeitgeist/src/zeitgeist/config.log:| #define PACKAGE_TARNAME "zeitgeist"
/var/lib/archbuild/extra-staging-with-build-support-i686/build/build/zeitgeist/src/zeitgeist/config.log:| #define PACKAGE_VERSION "1.0.4"
/var/lib/archbuild/extra-staging-with-build-support-i686/build/build/zeitgeist/src/zeitgeist/config.log:| #define PACKAGE_STRING "zeitgeist 1.0.4"
/var/lib/archbuild/extra-staging-with-build-support-i686/build/build/zeitgeist/src/zeitgeist/config.log:| #define PACKAGE_BUGREPORT "https://gitlab.freedesktop.org/zeitgeist/zeitgeist/issues"
/var/lib/archbuild/extra-staging-with-build-support-i686/build/build/zeitgeist/src/zeitgeist/config.log:| #define PACKAGE_URL "https://launchpad.net/zeitgeist/"
/var/lib/archbuild/extra-staging-with-build-support-i686/build/build/zeitgeist/src/zeitgeist/config.log:| #define PACKAGE "zeitgeist"
/var/lib/archbuild/extra-staging-with-build-support-i686/build/build/zeitgeist/src/zeitgeist/config.log:| #define VERSION "1.0.4"
/var/lib/archbuild/extra-staging-with-build-support-i686/build/build/zeitgeist/src/zeitgeist/config.log:| #define HAVE_STDIO_H 1
/var/lib/archbuild/extra-staging-with-build-support-i686/build/build/zeitgeist/src/zeitgeist/config.log:| #define HAVE_STDLIB_H 1
/var/lib/archbuild/extra-staging-with-build-support-i686/build/build/zeitgeist/src/zeitgeist/config.log:| #define HAVE_STRING_H 1
/var/lib/archbuild/extra-staging-with-build-support-i686/build/build/zeitgeist/src/zeitgeist/config.log:| #define HAVE_INTTYPES_H 1
/var/lib/archbuild/extra-staging-with-build-support-i686/build/build/zeitgeist/src/zeitgeist/config.log:| #define HAVE_STDINT_H 1
/var/lib/archbuild/extra-staging-with-build-support-i686/build/build/zeitgeist/src/zeitgeist/config.log:| #define HAVE_STRINGS_H 1
/var/lib/archbuild/extra-staging-with-build-support-i686/build/build/zeitgeist/src/zeitgeist/config.log:| #define HAVE_SYS_STAT_H 1
/var/lib/archbuild/extra-staging-with-build-support-i686/build/build/zeitgeist/src/zeitgeist/config.log:| #define HAVE_SYS_TYPES_H 1
/var/lib/archbuild/extra-staging-with-build-support-i686/build/build/zeitgeist/src/zeitgeist/config.log:| #define HAVE_UNISTD_H 1
/var/lib/archbuild/extra-staging-with-build-support-i686/build/build/zeitgeist/src/zeitgeist/config.log:| #define STDC_HEADERS 1
/var/lib/archbuild/extra-staging-with-build-support-i686/build/build/zeitgeist/src/zeitgeist/config.log:| #define HAVE_DLFCN_H 1
/var/lib/archbuild/extra-staging-with-build-support-i686/build/build/zeitgeist/src/zeitgeist/config.log:| #define LT_OBJDIR ".libs/"
/var/lib/archbuild/extra-staging-with-build-support-i686/build/build/zeitgeist/src/zeitgeist/config.log:| /* end confdefs.h.  */
/var/lib/archbuild/extra-staging-with-build-support-i686/build/build/zeitgeist/src/zeitgeist/config.log:| #include <ac_nonexistent.h>
/var/lib/archbuild/extra-staging-with-build-support-i686/build/build/zeitgeist/src/zeitgeist/config.log:configure:15396: result: g++ -E
/var/lib/archbuild/extra-staging-with-build-support-i686/build/build/zeitgeist/src/zeitgeist/config.log:configure:15410: g++ -E  conftest.cpp
/var/lib/archbuild/extra-staging-with-build-support-i686/build/build/zeitgeist/src/zeitgeist/config.log:configure:15410: $? = 0
/var/lib/archbuild/extra-staging-with-build-support-i686/build/build/zeitgeist/src/zeitgeist/config.log:configure:15426: g++ -E  conftest.cpp
/var/lib/archbuild/extra-staging-with-build-support-i686/build/build/zeitgeist/src/zeitgeist/config.log:conftest.cpp:23:10: fatal error: ac_nonexistent.h: No such file or directory
/var/lib/archbuild/extra-staging-with-build-support-i686/build/build/zeitgeist/src/zeitgeist/config.log:   23 | #include <ac_nonexistent.h>
/var/lib/archbuild/extra-staging-with-build-support-i686/build/build/zeitgeist/src/zeitgeist/config.log:      |          ^~~~~~~~~~~~~~~~~~
/var/lib/archbuild/extra-staging-with-build-support-i686/build/build/zeitgeist/src/zeitgeist/config.log:compilation terminated.
/var/lib/archbuild/extra-staging-with-build-support-i686/build/build/zeitgeist/src/zeitgeist/config.log:configure:15426: $? = 1
/var/lib/archbuild/extra-staging-with-build-support-i686/build/build/zeitgeist/src/zeitgeist/config.log:configure: failed program was:
/var/lib/archbuild/extra-staging-with-build-support-i686/build/build/zeitgeist/src/zeitgeist/config.log:| /* confdefs.h */
/var/lib/archbuild/extra-staging-with-build-support-i686/build/build/zeitgeist/src/zeitgeist/config.log:| #define PACKAGE_NAME "zeitgeist"
/var/lib/archbuild/extra-staging-with-build-support-i686/build/build/zeitgeist/src/zeitgeist/config.log:| #define PACKAGE_TARNAME "zeitgeist"
/var/lib/archbuild/extra-staging-with-build-support-i686/build/build/zeitgeist/src/zeitgeist/config.log:| #define PACKAGE_VERSION "1.0.4"
/var/lib/archbuild/extra-staging-with-build-support-i686/build/build/zeitgeist/src/zeitgeist/config.log:| #define PACKAGE_STRING "zeitgeist 1.0.4"
/var/lib/archbuild/extra-staging-with-build-support-i686/build/build/zeitgeist/src/zeitgeist/config.log:| #define PACKAGE_BUGREPORT "https://gitlab.freedesktop.org/zeitgeist/zeitgeist/issues"
/var/lib/archbuild/extra-staging-with-build-support-i686/build/build/zeitgeist/src/zeitgeist/config.log:| #define PACKAGE_URL "https://launchpad.net/zeitgeist/"
/var/lib/archbuild/extra-staging-with-build-support-i686/build/build/zeitgeist/src/zeitgeist/config.log:| #define PACKAGE "zeitgeist"
/var/lib/archbuild/extra-staging-with-build-support-i686/build/build/zeitgeist/src/zeitgeist/config.log:| #define VERSION "1.0.4"
/var/lib/archbuild/extra-staging-with-build-support-i686/build/build/zeitgeist/src/zeitgeist/config.log:| #define HAVE_STDIO_H 1
/var/lib/archbuild/extra-staging-with-build-support-i686/build/build/zeitgeist/src/zeitgeist/config.log:| #define HAVE_STDLIB_H 1
/var/lib/archbuild/extra-staging-with-build-support-i686/build/build/zeitgeist/src/zeitgeist/config.log:| #define HAVE_STRING_H 1
/var/lib/archbuild/extra-staging-with-build-support-i686/build/build/zeitgeist/src/zeitgeist/config.log:| #define HAVE_INTTYPES_H 1
/var/lib/archbuild/extra-staging-with-build-support-i686/build/build/zeitgeist/src/zeitgeist/config.log:| #define HAVE_STDINT_H 1
/var/lib/archbuild/extra-staging-with-build-support-i686/build/build/zeitgeist/src/zeitgeist/config.log:| #define HAVE_STRINGS_H 1
/var/lib/archbuild/extra-staging-with-build-support-i686/build/build/zeitgeist/src/zeitgeist/config.log:| #define HAVE_SYS_STAT_H 1
/var/lib/archbuild/extra-staging-with-build-support-i686/build/build/zeitgeist/src/zeitgeist/config.log:| #define HAVE_SYS_TYPES_H 1
/var/lib/archbuild/extra-staging-with-build-support-i686/build/build/zeitgeist/src/zeitgeist/config.log:| #define HAVE_UNISTD_H 1
/var/lib/archbuild/extra-staging-with-build-support-i686/build/build/zeitgeist/src/zeitgeist/config.log:| #define STDC_HEADERS 1
/var/lib/archbuild/extra-staging-with-build-support-i686/build/build/zeitgeist/src/zeitgeist/config.log:| #define HAVE_DLFCN_H 1
/var/lib/archbuild/extra-staging-with-build-support-i686/build/build/zeitgeist/src/zeitgeist/config.log:| #define LT_OBJDIR ".libs/"
/var/lib/archbuild/extra-staging-with-build-support-i686/build/build/zeitgeist/src/zeitgeist/config.log:| /* end confdefs.h.  */
/var/lib/archbuild/extra-staging-with-build-support-i686/build/build/zeitgeist/src/zeitgeist/config.log:| #include <ac_nonexistent.h>
/var/lib/archbuild/extra-staging-with-build-support-i686/build/build/zeitgeist/src/zeitgeist/config.log:configure:15594: checking for ld used by g++
/var/lib/archbuild/extra-staging-with-build-support-i686/build/build/zeitgeist/src/zeitgeist/config.log:configure:15663: result: /usr/bin/ld
/var/lib/archbuild/extra-staging-with-build-support-i686/build/build/zeitgeist/src/zeitgeist/config.log:configure:15670: checking if the linker (/usr/bin/ld) is GNU ld
/var/lib/archbuild/extra-staging-with-build-support-i686/build/build/zeitgeist/src/zeitgeist/config.log:configure:15687: result: yes
/var/lib/archbuild/extra-staging-with-build-support-i686/build/build/zeitgeist/src/zeitgeist/config.log:configure:15741: checking whether the g++ linker (/usr/bin/ld) supports shared libraries
/var/lib/archbuild/extra-staging-with-build-support-i686/build/build/zeitgeist/src/zeitgeist/config.log:configure:16829: result: yes
/var/lib/archbuild/extra-staging-with-build-support-i686/build/build/zeitgeist/src/zeitgeist/config.log:configure:16865: g++ -c -march=i686 -mtune=generic -O2 -pipe -fno-plt -fexceptions         -Wp,-D_FORTIFY_SOURCE=3 -Wformat -Werror=format-security         -fstack-clash-protection          -fno-omit-frame-pointer -mno-omit-leaf-frame-pointer -Wp,-D_GLIBCXX_ASSERTIONS -g -ffile-prefix-map=/build/zeitgeist/src=/usr/src/debug/zeitgeist -flto=auto  conftest.cpp >&5
/var/lib/archbuild/extra-staging-with-build-support-i686/build/build/zeitgeist/src/zeitgeist/config.log:configure:16868: $? = 0
/var/lib/archbuild/extra-staging-with-build-support-i686/build/build/zeitgeist/src/zeitgeist/config.log:configure:17354: checking for g++ option to produce PIC
/var/lib/archbuild/extra-staging-with-build-support-i686/build/build/zeitgeist/src/zeitgeist/config.log:configure:17363: result: -fPIC -DPIC
/var/lib/archbuild/extra-staging-with-build-support-i686/build/build/zeitgeist/src/zeitgeist/config.log:configure:17371: checking if g++ PIC flag -fPIC -DPIC works
/var/lib/archbuild/extra-staging-with-build-support-i686/build/build/zeitgeist/src/zeitgeist/config.log:configure:17390: g++ -c -march=i686 -mtune=generic -O2 -pipe -fno-plt -fexceptions         -Wp,-D_FORTIFY_SOURCE=3 -Wformat -Werror=format-security         -fstack-clash-protection          -fno-omit-frame-pointer -mno-omit-leaf-frame-pointer -Wp,-D_GLIBCXX_ASSERTIONS -g -ffile-prefix-map=/build/zeitgeist/src=/usr/src/debug/zeitgeist -flto=auto  -fPIC -DPIC -DPIC conftest.cpp >&5
/var/lib/archbuild/extra-staging-with-build-support-i686/build/build/zeitgeist/src/zeitgeist/config.log:configure:17394: $? = 0
/var/lib/archbuild/extra-staging-with-build-support-i686/build/build/zeitgeist/src/zeitgeist/config.log:configure:17408: result: yes
/var/lib/archbuild/extra-staging-with-build-support-i686/build/build/zeitgeist/src/zeitgeist/config.log:configure:17431: checking if g++ static flag -static works
/var/lib/archbuild/extra-staging-with-build-support-i686/build/build/zeitgeist/src/zeitgeist/config.log:configure:17461: result: yes
/var/lib/archbuild/extra-staging-with-build-support-i686/build/build/zeitgeist/src/zeitgeist/config.log:configure:17473: checking if g++ supports -c -o file.o
/var/lib/archbuild/extra-staging-with-build-support-i686/build/build/zeitgeist/src/zeitgeist/config.log:configure:17495: g++ -c -march=i686 -mtune=generic -O2 -pipe -fno-plt -fexceptions         -Wp,-D_FORTIFY_SOURCE=3 -Wformat -Werror=format-security         -fstack-clash-protection          -fno-omit-frame-pointer -mno-omit-leaf-frame-pointer -Wp,-D_GLIBCXX_ASSERTIONS -g -ffile-prefix-map=/build/zeitgeist/src=/usr/src/debug/zeitgeist -flto=auto  -o out/conftest2.o conftest.cpp >&5
/var/lib/archbuild/extra-staging-with-build-support-i686/build/build/zeitgeist/src/zeitgeist/config.log:configure:17499: $? = 0
/var/lib/archbuild/extra-staging-with-build-support-i686/build/build/zeitgeist/src/zeitgeist/config.log:configure:17522: result: yes
/var/lib/archbuild/extra-staging-with-build-support-i686/build/build/zeitgeist/src/zeitgeist/config.log:configure:17527: checking if g++ supports -c -o file.o
/var/lib/archbuild/extra-staging-with-build-support-i686/build/build/zeitgeist/src/zeitgeist/config.log:configure:17576: result: yes
/var/lib/archbuild/extra-staging-with-build-support-i686/build/build/zeitgeist/src/zeitgeist/config.log:configure:17606: checking whether the g++ linker (/usr/bin/ld) supports shared libraries
/var/lib/archbuild/extra-staging-with-build-support-i686/build/build/zeitgeist/src/zeitgeist/config.log:configure:17646: result: yes
/var/lib/archbuild/extra-staging-with-build-support-i686/build/build/zeitgeist/src/zeitgeist/config.log:configure:17789: checking dynamic linker characteristics
/var/lib/archbuild/extra-staging-with-build-support-i686/build/build/zeitgeist/src/zeitgeist/config.log:configure:19083: result: GNU/Linux ld.so
/var/lib/archbuild/extra-staging-with-build-support-i686/build/build/zeitgeist/src/zeitgeist/config.log:configure:19148: checking how to hardcode library paths into programs
/var/lib/archbuild/extra-staging-with-build-support-i686/build/build/zeitgeist/src/zeitgeist/config.log:configure:19173: result: immediate
/var/lib/archbuild/extra-staging-with-build-support-i686/build/build/zeitgeist/src/zeitgeist/config.log:configure:19294: checking for pkg-config
/var/lib/archbuild/extra-staging-with-build-support-i686/build/build/zeitgeist/src/zeitgeist/config.log:configure:19317: found /usr/bin/pkg-config
/var/lib/archbuild/extra-staging-with-build-support-i686/build/build/zeitgeist/src/zeitgeist/config.log:configure:19330: result: /usr/bin/pkg-config
/var/lib/archbuild/extra-staging-with-build-support-i686/build/build/zeitgeist/src/zeitgeist/config.log:configure:19355: checking pkg-config is at least version 0.21
/var/lib/archbuild/extra-staging-with-build-support-i686/build/build/zeitgeist/src/zeitgeist/config.log:configure:19358: result: yes
/var/lib/archbuild/extra-staging-with-build-support-i686/build/build/zeitgeist/src/zeitgeist/config.log:configure:19372: checking for valac
/var/lib/archbuild/extra-staging-with-build-support-i686/build/build/zeitgeist/src/zeitgeist/config.log:configure:19395: found /usr/bin/valac
/var/lib/archbuild/extra-staging-with-build-support-i686/build/build/zeitgeist/src/zeitgeist/config.log:configure:19409: result: /usr/bin/valac
/var/lib/archbuild/extra-staging-with-build-support-i686/build/build/zeitgeist/src/zeitgeist/config.log:configure:19419: checking whether /usr/bin/valac supports at least API version 0.32.1
/var/lib/archbuild/extra-staging-with-build-support-i686/build/build/zeitgeist/src/zeitgeist/config.log:configure:19427: result: yes
/var/lib/archbuild/extra-staging-with-build-support-i686/build/build/zeitgeist/src/zeitgeist/config.log:configure:19463: checking whether NLS is requested
/var/lib/archbuild/extra-staging-with-build-support-i686/build/build/zeitgeist/src/zeitgeist/config.log:configure:19474: result: yes
/var/lib/archbuild/extra-staging-with-build-support-i686/build/build/zeitgeist/src/zeitgeist/config.log:configure:19514: checking for msgfmt
/var/lib/archbuild/extra-staging-with-build-support-i686/build/build/zeitgeist/src/zeitgeist/config.log:configure: trying /usr/bin/msgfmt...
/var/lib/archbuild/extra-staging-with-build-support-i686/build/build/zeitgeist/src/zeitgeist/config.log:0 translated messages.
/var/lib/archbuild/extra-staging-with-build-support-i686/build/build/zeitgeist/src/zeitgeist/config.log:configure:19548: result: /usr/bin/msgfmt
/var/lib/archbuild/extra-staging-with-build-support-i686/build/build/zeitgeist/src/zeitgeist/config.log:configure:19557: checking for gmsgfmt
/var/lib/archbuild/extra-staging-with-build-support-i686/build/build/zeitgeist/src/zeitgeist/config.log:configure:19594: result: /usr/bin/msgfmt
/var/lib/archbuild/extra-staging-with-build-support-i686/build/build/zeitgeist/src/zeitgeist/config.log:configure:19639: checking for xgettext
/var/lib/archbuild/extra-staging-with-build-support-i686/build/build/zeitgeist/src/zeitgeist/config.log:configure: trying /usr/bin/xgettext...
/var/lib/archbuild/extra-staging-with-build-support-i686/build/build/zeitgeist/src/zeitgeist/config.log:/usr/bin/xgettext: warning: file '/dev/null' extension '' is unknown; will try C
/var/lib/archbuild/extra-staging-with-build-support-i686/build/build/zeitgeist/src/zeitgeist/config.log:configure:19673: result: /usr/bin/xgettext
/var/lib/archbuild/extra-staging-with-build-support-i686/build/build/zeitgeist/src/zeitgeist/config.log:configure:19718: checking for msgmerge
/var/lib/archbuild/extra-staging-with-build-support-i686/build/build/zeitgeist/src/zeitgeist/config.log:configure: trying /usr/bin/msgmerge...
/var/lib/archbuild/extra-staging-with-build-support-i686/build/build/zeitgeist/src/zeitgeist/config.log:configure:19751: result: /usr/bin/msgmerge
/var/lib/archbuild/extra-staging-with-build-support-i686/build/build/zeitgeist/src/zeitgeist/config.log:configure:19817: checking for ld
/var/lib/archbuild/extra-staging-with-build-support-i686/build/build/zeitgeist/src/zeitgeist/config.log:configure:19950: result: /usr/bin/ld
/var/lib/archbuild/extra-staging-with-build-support-i686/build/build/zeitgeist/src/zeitgeist/config.log:configure:19957: checking if the linker (/usr/bin/ld) is GNU ld
/var/lib/archbuild/extra-staging-with-build-support-i686/build/build/zeitgeist/src/zeitgeist/config.log:configure:19974: result: yes
/var/lib/archbuild/extra-staging-with-build-support-i686/build/build/zeitgeist/src/zeitgeist/config.log:configure:19982: checking for shared library run path origin
/var/lib/archbuild/extra-staging-with-build-support-i686/build/build/zeitgeist/src/zeitgeist/config.log:configure:19997: result: done
/var/lib/archbuild/extra-staging-with-build-support-i686/build/build/zeitgeist/src/zeitgeist/config.log:configure:20020: checking 32-bit host C ABI
/var/lib/archbuild/extra-staging-with-build-support-i686/build/build/zeitgeist/src/zeitgeist/config.log:configure:20073: gcc -c -march=i686 -mtune=generic -O2 -pipe -fno-plt -fexceptions         -Wp,-D_FORTIFY_SOURCE=3 -Wformat -Werror=format-security         -fstack-clash-protection          -fno-omit-frame-pointer -mno-omit-leaf-frame-pointer -g -ffile-prefix-map=/build/zeitgeist/src=/usr/src/debug/zeitgeist -flto=auto  conftest.c >&5
/var/lib/archbuild/extra-staging-with-build-support-i686/build/build/zeitgeist/src/zeitgeist/config.log:conftest.c:24:5: error: size of array 'test_pointer_size' is too large
/var/lib/archbuild/extra-staging-with-build-support-i686/build/build/zeitgeist/src/zeitgeist/config.log:   24 | int test_pointer_size[sizeof (void *) - 5];
/var/lib/archbuild/extra-staging-with-build-support-i686/build/build/zeitgeist/src/zeitgeist/config.log:      |     ^~~~~~~~~~~~~~~~~
/var/lib/archbuild/extra-staging-with-build-support-i686/build/build/zeitgeist/src/zeitgeist/config.log:configure:20073: $? = 1
/var/lib/archbuild/extra-staging-with-build-support-i686/build/build/zeitgeist/src/zeitgeist/config.log:configure: failed program was:
/var/lib/archbuild/extra-staging-with-build-support-i686/build/build/zeitgeist/src/zeitgeist/config.log:| /* confdefs.h */
/var/lib/archbuild/extra-staging-with-build-support-i686/build/build/zeitgeist/src/zeitgeist/config.log:| #define PACKAGE_NAME "zeitgeist"
/var/lib/archbuild/extra-staging-with-build-support-i686/build/build/zeitgeist/src/zeitgeist/config.log:| #define PACKAGE_TARNAME "zeitgeist"
/var/lib/archbuild/extra-staging-with-build-support-i686/build/build/zeitgeist/src/zeitgeist/config.log:| #define PACKAGE_VERSION "1.0.4"
/var/lib/archbuild/extra-staging-with-build-support-i686/build/build/zeitgeist/src/zeitgeist/config.log:| #define PACKAGE_STRING "zeitgeist 1.0.4"
/var/lib/archbuild/extra-staging-with-build-support-i686/build/build/zeitgeist/src/zeitgeist/config.log:| #define PACKAGE_BUGREPORT "https://gitlab.freedesktop.org/zeitgeist/zeitgeist/issues"
/var/lib/archbuild/extra-staging-with-build-support-i686/build/build/zeitgeist/src/zeitgeist/config.log:| #define PACKAGE_URL "https://launchpad.net/zeitgeist/"
/var/lib/archbuild/extra-staging-with-build-support-i686/build/build/zeitgeist/src/zeitgeist/config.log:| #define PACKAGE "zeitgeist"
/var/lib/archbuild/extra-staging-with-build-support-i686/build/build/zeitgeist/src/zeitgeist/config.log:| #define VERSION "1.0.4"
/var/lib/archbuild/extra-staging-with-build-support-i686/build/build/zeitgeist/src/zeitgeist/config.log:| #define HAVE_STDIO_H 1
/var/lib/archbuild/extra-staging-with-build-support-i686/build/build/zeitgeist/src/zeitgeist/config.log:| #define HAVE_STDLIB_H 1
/var/lib/archbuild/extra-staging-with-build-support-i686/build/build/zeitgeist/src/zeitgeist/config.log:| #define HAVE_STRING_H 1
/var/lib/archbuild/extra-staging-with-build-support-i686/build/build/zeitgeist/src/zeitgeist/config.log:| #define HAVE_INTTYPES_H 1
/var/lib/archbuild/extra-staging-with-build-support-i686/build/build/zeitgeist/src/zeitgeist/config.log:| #define HAVE_STDINT_H 1
/var/lib/archbuild/extra-staging-with-build-support-i686/build/build/zeitgeist/src/zeitgeist/config.log:| #define HAVE_STRINGS_H 1
/var/lib/archbuild/extra-staging-with-build-support-i686/build/build/zeitgeist/src/zeitgeist/config.log:| #define HAVE_SYS_STAT_H 1
/var/lib/archbuild/extra-staging-with-build-support-i686/build/build/zeitgeist/src/zeitgeist/config.log:| #define HAVE_SYS_TYPES_H 1
/var/lib/archbuild/extra-staging-with-build-support-i686/build/build/zeitgeist/src/zeitgeist/config.log:| #define HAVE_UNISTD_H 1
/var/lib/archbuild/extra-staging-with-build-support-i686/build/build/zeitgeist/src/zeitgeist/config.log:| #define STDC_HEADERS 1
/var/lib/archbuild/extra-staging-with-build-support-i686/build/build/zeitgeist/src/zeitgeist/config.log:| #define HAVE_DLFCN_H 1
/var/lib/archbuild/extra-staging-with-build-support-i686/build/build/zeitgeist/src/zeitgeist/config.log:| #define LT_OBJDIR ".libs/"
/var/lib/archbuild/extra-staging-with-build-support-i686/build/build/zeitgeist/src/zeitgeist/config.log:| #define GETTEXT_PACKAGE "zeitgeist"
/var/lib/archbuild/extra-staging-with-build-support-i686/build/build/zeitgeist/src/zeitgeist/config.log:| /* end confdefs.h.  */
/var/lib/archbuild/extra-staging-with-build-support-i686/build/build/zeitgeist/src/zeitgeist/config.log:| int test_pointer_size[sizeof (void *) - 5];
/var/lib/archbuild/extra-staging-with-build-support-i686/build/build/zeitgeist/src/zeitgeist/config.log:| 
/var/lib/archbuild/extra-staging-with-build-support-i686/build/build/zeitgeist/src/zeitgeist/config.log:configure:20087: result: yes
/var/lib/archbuild/extra-staging-with-build-support-i686/build/build/zeitgeist/src/zeitgeist/config.log:configure:20097: checking how to run the C preprocessor
/var/lib/archbuild/extra-staging-with-build-support-i686/build/build/zeitgeist/src/zeitgeist/config.log:configure:20123: gcc -E  conftest.c
/var/lib/archbuild/extra-staging-with-build-support-i686/build/build/zeitgeist/src/zeitgeist/config.log:configure:20123: $? = 0
/var/lib/archbuild/extra-staging-with-build-support-i686/build/build/zeitgeist/src/zeitgeist/config.log:configure:20139: gcc -E  conftest.c
/var/lib/archbuild/extra-staging-with-build-support-i686/build/build/zeitgeist/src/zeitgeist/config.log:conftest.c:24:10: fatal error: ac_nonexistent.h: No such file or directory
/var/lib/archbuild/extra-staging-with-build-support-i686/build/build/zeitgeist/src/zeitgeist/config.log:   24 | #include <ac_nonexistent.h>
/var/lib/archbuild/extra-staging-with-build-support-i686/build/build/zeitgeist/src/zeitgeist/config.log:      |          ^~~~~~~~~~~~~~~~~~
/var/lib/archbuild/extra-staging-with-build-support-i686/build/build/zeitgeist/src/zeitgeist/config.log:compilation terminated.
/var/lib/archbuild/extra-staging-with-build-support-i686/build/build/zeitgeist/src/zeitgeist/config.log:configure:20139: $? = 1
/var/lib/archbuild/extra-staging-with-build-support-i686/build/build/zeitgeist/src/zeitgeist/config.log:configure: failed program was:
/var/lib/archbuild/extra-staging-with-build-support-i686/build/build/zeitgeist/src/zeitgeist/config.log:| /* confdefs.h */
/var/lib/archbuild/extra-staging-with-build-support-i686/build/build/zeitgeist/src/zeitgeist/config.log:| #define PACKAGE_NAME "zeitgeist"
/var/lib/archbuild/extra-staging-with-build-support-i686/build/build/zeitgeist/src/zeitgeist/config.log:| #define PACKAGE_TARNAME "zeitgeist"
/var/lib/archbuild/extra-staging-with-build-support-i686/build/build/zeitgeist/src/zeitgeist/config.log:| #define PACKAGE_VERSION "1.0.4"
/var/lib/archbuild/extra-staging-with-build-support-i686/build/build/zeitgeist/src/zeitgeist/config.log:| #define PACKAGE_STRING "zeitgeist 1.0.4"
/var/lib/archbuild/extra-staging-with-build-support-i686/build/build/zeitgeist/src/zeitgeist/config.log:| #define PACKAGE_BUGREPORT "https://gitlab.freedesktop.org/zeitgeist/zeitgeist/issues"
/var/lib/archbuild/extra-staging-with-build-support-i686/build/build/zeitgeist/src/zeitgeist/config.log:| #define PACKAGE_URL "https://launchpad.net/zeitgeist/"
/var/lib/archbuild/extra-staging-with-build-support-i686/build/build/zeitgeist/src/zeitgeist/config.log:| #define PACKAGE "zeitgeist"
/var/lib/archbuild/extra-staging-with-build-support-i686/build/build/zeitgeist/src/zeitgeist/config.log:| #define VERSION "1.0.4"
/var/lib/archbuild/extra-staging-with-build-support-i686/build/build/zeitgeist/src/zeitgeist/config.log:| #define HAVE_STDIO_H 1
/var/lib/archbuild/extra-staging-with-build-support-i686/build/build/zeitgeist/src/zeitgeist/config.log:| #define HAVE_STDLIB_H 1
/var/lib/archbuild/extra-staging-with-build-support-i686/build/build/zeitgeist/src/zeitgeist/config.log:| #define HAVE_STRING_H 1
/var/lib/archbuild/extra-staging-with-build-support-i686/build/build/zeitgeist/src/zeitgeist/config.log:| #define HAVE_INTTYPES_H 1
/var/lib/archbuild/extra-staging-with-build-support-i686/build/build/zeitgeist/src/zeitgeist/config.log:| #define HAVE_STDINT_H 1
/var/lib/archbuild/extra-staging-with-build-support-i686/build/build/zeitgeist/src/zeitgeist/config.log:| #define HAVE_STRINGS_H 1
/var/lib/archbuild/extra-staging-with-build-support-i686/build/build/zeitgeist/src/zeitgeist/config.log:| #define HAVE_SYS_STAT_H 1
/var/lib/archbuild/extra-staging-with-build-support-i686/build/build/zeitgeist/src/zeitgeist/config.log:| #define HAVE_SYS_TYPES_H 1
/var/lib/archbuild/extra-staging-with-build-support-i686/build/build/zeitgeist/src/zeitgeist/config.log:| #define HAVE_UNISTD_H 1
/var/lib/archbuild/extra-staging-with-build-support-i686/build/build/zeitgeist/src/zeitgeist/config.log:| #define STDC_HEADERS 1
/var/lib/archbuild/extra-staging-with-build-support-i686/build/build/zeitgeist/src/zeitgeist/config.log:| #define HAVE_DLFCN_H 1
/var/lib/archbuild/extra-staging-with-build-support-i686/build/build/zeitgeist/src/zeitgeist/config.log:| #define LT_OBJDIR ".libs/"
/var/lib/archbuild/extra-staging-with-build-support-i686/build/build/zeitgeist/src/zeitgeist/config.log:| #define GETTEXT_PACKAGE "zeitgeist"
/var/lib/archbuild/extra-staging-with-build-support-i686/build/build/zeitgeist/src/zeitgeist/config.log:| /* end confdefs.h.  */
/var/lib/archbuild/extra-staging-with-build-support-i686/build/build/zeitgeist/src/zeitgeist/config.log:| #include <ac_nonexistent.h>
/var/lib/archbuild/extra-staging-with-build-support-i686/build/build/zeitgeist/src/zeitgeist/config.log:configure:20168: result: gcc -E
/var/lib/archbuild/extra-staging-with-build-support-i686/build/build/zeitgeist/src/zeitgeist/config.log:configure:20182: gcc -E  conftest.c
/var/lib/archbuild/extra-staging-with-build-support-i686/build/build/zeitgeist/src/zeitgeist/config.log:configure:20182: $? = 0
/var/lib/archbuild/extra-staging-with-build-support-i686/build/build/zeitgeist/src/zeitgeist/config.log:configure:20198: gcc -E  conftest.c
/var/lib/archbuild/extra-staging-with-build-support-i686/build/build/zeitgeist/src/zeitgeist/config.log:conftest.c:24:10: fatal error: ac_nonexistent.h: No such file or directory
/var/lib/archbuild/extra-staging-with-build-support-i686/build/build/zeitgeist/src/zeitgeist/config.log:   24 | #include <ac_nonexistent.h>
/var/lib/archbuild/extra-staging-with-build-support-i686/build/build/zeitgeist/src/zeitgeist/config.log:      |          ^~~~~~~~~~~~~~~~~~
/var/lib/archbuild/extra-staging-with-build-support-i686/build/build/zeitgeist/src/zeitgeist/config.log:compilation terminated.
/var/lib/archbuild/extra-staging-with-build-support-i686/build/build/zeitgeist/src/zeitgeist/config.log:configure:20198: $? = 1
/var/lib/archbuild/extra-staging-with-build-support-i686/build/build/zeitgeist/src/zeitgeist/config.log:configure: failed program was:
/var/lib/archbuild/extra-staging-with-build-support-i686/build/build/zeitgeist/src/zeitgeist/config.log:| /* confdefs.h */
/var/lib/archbuild/extra-staging-with-build-support-i686/build/build/zeitgeist/src/zeitgeist/config.log:| #define PACKAGE_NAME "zeitgeist"
/var/lib/archbuild/extra-staging-with-build-support-i686/build/build/zeitgeist/src/zeitgeist/config.log:| #define PACKAGE_TARNAME "zeitgeist"
/var/lib/archbuild/extra-staging-with-build-support-i686/build/build/zeitgeist/src/zeitgeist/config.log:| #define PACKAGE_VERSION "1.0.4"
/var/lib/archbuild/extra-staging-with-build-support-i686/build/build/zeitgeist/src/zeitgeist/config.log:| #define PACKAGE_STRING "zeitgeist 1.0.4"
/var/lib/archbuild/extra-staging-with-build-support-i686/build/build/zeitgeist/src/zeitgeist/config.log:| #define PACKAGE_BUGREPORT "https://gitlab.freedesktop.org/zeitgeist/zeitgeist/issues"
/var/lib/archbuild/extra-staging-with-build-support-i686/build/build/zeitgeist/src/zeitgeist/config.log:| #define PACKAGE_URL "https://launchpad.net/zeitgeist/"
/var/lib/archbuild/extra-staging-with-build-support-i686/build/build/zeitgeist/src/zeitgeist/config.log:| #define PACKAGE "zeitgeist"
/var/lib/archbuild/extra-staging-with-build-support-i686/build/build/zeitgeist/src/zeitgeist/config.log:| #define VERSION "1.0.4"
/var/lib/archbuild/extra-staging-with-build-support-i686/build/build/zeitgeist/src/zeitgeist/config.log:| #define HAVE_STDIO_H 1
/var/lib/archbuild/extra-staging-with-build-support-i686/build/build/zeitgeist/src/zeitgeist/config.log:| #define HAVE_STDLIB_H 1
/var/lib/archbuild/extra-staging-with-build-support-i686/build/build/zeitgeist/src/zeitgeist/config.log:| #define HAVE_STRING_H 1
/var/lib/archbuild/extra-staging-with-build-support-i686/build/build/zeitgeist/src/zeitgeist/config.log:| #define HAVE_INTTYPES_H 1
/var/lib/archbuild/extra-staging-with-build-support-i686/build/build/zeitgeist/src/zeitgeist/config.log:| #define HAVE_STDINT_H 1
/var/lib/archbuild/extra-staging-with-build-support-i686/build/build/zeitgeist/src/zeitgeist/config.log:| #define HAVE_STRINGS_H 1
/var/lib/archbuild/extra-staging-with-build-support-i686/build/build/zeitgeist/src/zeitgeist/config.log:| #define HAVE_SYS_STAT_H 1
/var/lib/archbuild/extra-staging-with-build-support-i686/build/build/zeitgeist/src/zeitgeist/config.log:| #define HAVE_SYS_TYPES_H 1
/var/lib/archbuild/extra-staging-with-build-support-i686/build/build/zeitgeist/src/zeitgeist/config.log:| #define HAVE_UNISTD_H 1
/var/lib/archbuild/extra-staging-with-build-support-i686/build/build/zeitgeist/src/zeitgeist/config.log:| #define STDC_HEADERS 1
/var/lib/archbuild/extra-staging-with-build-support-i686/build/build/zeitgeist/src/zeitgeist/config.log:| #define HAVE_DLFCN_H 1
/var/lib/archbuild/extra-staging-with-build-support-i686/build/build/zeitgeist/src/zeitgeist/config.log:| #define LT_OBJDIR ".libs/"
/var/lib/archbuild/extra-staging-with-build-support-i686/build/build/zeitgeist/src/zeitgeist/config.log:| #define GETTEXT_PACKAGE "zeitgeist"
/var/lib/archbuild/extra-staging-with-build-support-i686/build/build/zeitgeist/src/zeitgeist/config.log:| /* end confdefs.h.  */
/var/lib/archbuild/extra-staging-with-build-support-i686/build/build/zeitgeist/src/zeitgeist/config.log:| #include <ac_nonexistent.h>
/var/lib/archbuild/extra-staging-with-build-support-i686/build/build/zeitgeist/src/zeitgeist/config.log:configure:20231: checking for egrep -e
/var/lib/archbuild/extra-staging-with-build-support-i686/build/build/zeitgeist/src/zeitgeist/config.log:configure:20361: result: /usr/bin/grep -E
/var/lib/archbuild/extra-staging-with-build-support-i686/build/build/zeitgeist/src/zeitgeist/config.log:configure:20369: checking for ELF binary format
/var/lib/archbuild/extra-staging-with-build-support-i686/build/build/zeitgeist/src/zeitgeist/config.log:configure:20395: result: yes
/var/lib/archbuild/extra-staging-with-build-support-i686/build/build/zeitgeist/src/zeitgeist/config.log:configure:20447: checking for the common suffixes of directories in the library search path
/var/lib/archbuild/extra-staging-with-build-support-i686/build/build/zeitgeist/src/zeitgeist/config.log:configure:20524: result: lib,lib,lib
/var/lib/archbuild/extra-staging-with-build-support-i686/build/build/zeitgeist/src/zeitgeist/config.log:configure:21095: checking for CFPreferencesCopyAppValue
/var/lib/archbuild/extra-staging-with-build-support-i686/build/build/zeitgeist/src/zeitgeist/config.log:configure:21114: gcc -o conftest -march=i686 -mtune=generic -O2 -pipe -fno-plt -fexceptions         -Wp,-D_FORTIFY_SOURCE=3 -Wformat -Werror=format-security         -fstack-clash-protection          -fno-omit-frame-pointer -mno-omit-leaf-frame-pointer -g -ffile-prefix-map=/build/zeitgeist/src=/usr/src/debug/zeitgeist -flto=auto  -Wl,-O1 -Wl,--sort-common -Wl,--as-needed -Wl,-z,relro -Wl,-z,now          -Wl,-z,pack-relative-relocs -flto=auto conftest.c  -Wl,-framework -Wl,CoreFoundation >&5
/var/lib/archbuild/extra-staging-with-build-support-i686/build/build/zeitgeist/src/zeitgeist/config.log:conftest.c:24:10: fatal error: CoreFoundation/CFPreferences.h: No such file or directory
/var/lib/archbuild/extra-staging-with-build-support-i686/build/build/zeitgeist/src/zeitgeist/config.log:   24 | #include <CoreFoundation/CFPreferences.h>
/var/lib/archbuild/extra-staging-with-build-support-i686/build/build/zeitgeist/src/zeitgeist/config.log:      |          ^~~~~~~~~~~~~~~~~~~~~~~~~~~~~~~~
/var/lib/archbuild/extra-staging-with-build-support-i686/build/build/zeitgeist/src/zeitgeist/config.log:compilation terminated.
/var/lib/archbuild/extra-staging-with-build-support-i686/build/build/zeitgeist/src/zeitgeist/config.log:configure:21114: $? = 1
/var/lib/archbuild/extra-staging-with-build-support-i686/build/build/zeitgeist/src/zeitgeist/config.log:configure: failed program was:
/var/lib/archbuild/extra-staging-with-build-support-i686/build/build/zeitgeist/src/zeitgeist/config.log:| /* confdefs.h */
/var/lib/archbuild/extra-staging-with-build-support-i686/build/build/zeitgeist/src/zeitgeist/config.log:| #define PACKAGE_NAME "zeitgeist"
/var/lib/archbuild/extra-staging-with-build-support-i686/build/build/zeitgeist/src/zeitgeist/config.log:| #define PACKAGE_TARNAME "zeitgeist"
/var/lib/archbuild/extra-staging-with-build-support-i686/build/build/zeitgeist/src/zeitgeist/config.log:| #define PACKAGE_VERSION "1.0.4"
/var/lib/archbuild/extra-staging-with-build-support-i686/build/build/zeitgeist/src/zeitgeist/config.log:| #define PACKAGE_STRING "zeitgeist 1.0.4"
/var/lib/archbuild/extra-staging-with-build-support-i686/build/build/zeitgeist/src/zeitgeist/config.log:| #define PACKAGE_BUGREPORT "https://gitlab.freedesktop.org/zeitgeist/zeitgeist/issues"
/var/lib/archbuild/extra-staging-with-build-support-i686/build/build/zeitgeist/src/zeitgeist/config.log:| #define PACKAGE_URL "https://launchpad.net/zeitgeist/"
/var/lib/archbuild/extra-staging-with-build-support-i686/build/build/zeitgeist/src/zeitgeist/config.log:| #define PACKAGE "zeitgeist"
/var/lib/archbuild/extra-staging-with-build-support-i686/build/build/zeitgeist/src/zeitgeist/config.log:| #define VERSION "1.0.4"
/var/lib/archbuild/extra-staging-with-build-support-i686/build/build/zeitgeist/src/zeitgeist/config.log:| #define HAVE_STDIO_H 1
/var/lib/archbuild/extra-staging-with-build-support-i686/build/build/zeitgeist/src/zeitgeist/config.log:| #define HAVE_STDLIB_H 1
/var/lib/archbuild/extra-staging-with-build-support-i686/build/build/zeitgeist/src/zeitgeist/config.log:| #define HAVE_STRING_H 1
/var/lib/archbuild/extra-staging-with-build-support-i686/build/build/zeitgeist/src/zeitgeist/config.log:| #define HAVE_INTTYPES_H 1
/var/lib/archbuild/extra-staging-with-build-support-i686/build/build/zeitgeist/src/zeitgeist/config.log:| #define HAVE_STDINT_H 1
/var/lib/archbuild/extra-staging-with-build-support-i686/build/build/zeitgeist/src/zeitgeist/config.log:| #define HAVE_STRINGS_H 1
/var/lib/archbuild/extra-staging-with-build-support-i686/build/build/zeitgeist/src/zeitgeist/config.log:| #define HAVE_SYS_STAT_H 1
/var/lib/archbuild/extra-staging-with-build-support-i686/build/build/zeitgeist/src/zeitgeist/config.log:| #define HAVE_SYS_TYPES_H 1
/var/lib/archbuild/extra-staging-with-build-support-i686/build/build/zeitgeist/src/zeitgeist/config.log:| #define HAVE_UNISTD_H 1
/var/lib/archbuild/extra-staging-with-build-support-i686/build/build/zeitgeist/src/zeitgeist/config.log:| #define STDC_HEADERS 1
/var/lib/archbuild/extra-staging-with-build-support-i686/build/build/zeitgeist/src/zeitgeist/config.log:| #define HAVE_DLFCN_H 1
/var/lib/archbuild/extra-staging-with-build-support-i686/build/build/zeitgeist/src/zeitgeist/config.log:| #define LT_OBJDIR ".libs/"
/var/lib/archbuild/extra-staging-with-build-support-i686/build/build/zeitgeist/src/zeitgeist/config.log:| #define GETTEXT_PACKAGE "zeitgeist"
/var/lib/archbuild/extra-staging-with-build-support-i686/build/build/zeitgeist/src/zeitgeist/config.log:| /* end confdefs.h.  */
/var/lib/archbuild/extra-staging-with-build-support-i686/build/build/zeitgeist/src/zeitgeist/config.log:| #include <CoreFoundation/CFPreferences.h>
/var/lib/archbuild/extra-staging-with-build-support-i686/build/build/zeitgeist/src/zeitgeist/config.log:| int
/var/lib/archbuild/extra-staging-with-build-support-i686/build/build/zeitgeist/src/zeitgeist/config.log:| main (void)
/var/lib/archbuild/extra-staging-with-build-support-i686/build/build/zeitgeist/src/zeitgeist/config.log:| {
/var/lib/archbuild/extra-staging-with-build-support-i686/build/build/zeitgeist/src/zeitgeist/config.log:| CFPreferencesCopyAppValue(NULL, NULL)
/var/lib/archbuild/extra-staging-with-build-support-i686/build/build/zeitgeist/src/zeitgeist/config.log:|   ;
/var/lib/archbuild/extra-staging-with-build-support-i686/build/build/zeitgeist/src/zeitgeist/config.log:|   return 0;
/var/lib/archbuild/extra-staging-with-build-support-i686/build/build/zeitgeist/src/zeitgeist/config.log:| }
/var/lib/archbuild/extra-staging-with-build-support-i686/build/build/zeitgeist/src/zeitgeist/config.log:configure:21126: result: no
/var/lib/archbuild/extra-staging-with-build-support-i686/build/build/zeitgeist/src/zeitgeist/config.log:configure:21133: checking for CFLocaleCopyPreferredLanguages
/var/lib/archbuild/extra-staging-with-build-support-i686/build/build/zeitgeist/src/zeitgeist/config.log:configure:21152: gcc -o conftest -march=i686 -mtune=generic -O2 -pipe -fno-plt -fexceptions         -Wp,-D_FORTIFY_SOURCE=3 -Wformat -Werror=format-security         -fstack-clash-protection          -fno-omit-frame-pointer -mno-omit-leaf-frame-pointer -g -ffile-prefix-map=/build/zeitgeist/src=/usr/src/debug/zeitgeist -flto=auto  -Wl,-O1 -Wl,--sort-common -Wl,--as-needed -Wl,-z,relro -Wl,-z,now          -Wl,-z,pack-relative-relocs -flto=auto conftest.c  -Wl,-framework -Wl,CoreFoundation >&5
/var/lib/archbuild/extra-staging-with-build-support-i686/build/build/zeitgeist/src/zeitgeist/config.log:conftest.c:24:10: fatal error: CoreFoundation/CFLocale.h: No such file or directory
/var/lib/archbuild/extra-staging-with-build-support-i686/build/build/zeitgeist/src/zeitgeist/config.log:   24 | #include <CoreFoundation/CFLocale.h>
/var/lib/archbuild/extra-staging-with-build-support-i686/build/build/zeitgeist/src/zeitgeist/config.log:      |          ^~~~~~~~~~~~~~~~~~~~~~~~~~~
/var/lib/archbuild/extra-staging-with-build-support-i686/build/build/zeitgeist/src/zeitgeist/config.log:compilation terminated.
/var/lib/archbuild/extra-staging-with-build-support-i686/build/build/zeitgeist/src/zeitgeist/config.log:configure:21152: $? = 1
/var/lib/archbuild/extra-staging-with-build-support-i686/build/build/zeitgeist/src/zeitgeist/config.log:configure: failed program was:
/var/lib/archbuild/extra-staging-with-build-support-i686/build/build/zeitgeist/src/zeitgeist/config.log:| /* confdefs.h */
/var/lib/archbuild/extra-staging-with-build-support-i686/build/build/zeitgeist/src/zeitgeist/config.log:| #define PACKAGE_NAME "zeitgeist"
/var/lib/archbuild/extra-staging-with-build-support-i686/build/build/zeitgeist/src/zeitgeist/config.log:| #define PACKAGE_TARNAME "zeitgeist"
/var/lib/archbuild/extra-staging-with-build-support-i686/build/build/zeitgeist/src/zeitgeist/config.log:| #define PACKAGE_VERSION "1.0.4"
/var/lib/archbuild/extra-staging-with-build-support-i686/build/build/zeitgeist/src/zeitgeist/config.log:| #define PACKAGE_STRING "zeitgeist 1.0.4"
/var/lib/archbuild/extra-staging-with-build-support-i686/build/build/zeitgeist/src/zeitgeist/config.log:| #define PACKAGE_BUGREPORT "https://gitlab.freedesktop.org/zeitgeist/zeitgeist/issues"
/var/lib/archbuild/extra-staging-with-build-support-i686/build/build/zeitgeist/src/zeitgeist/config.log:| #define PACKAGE_URL "https://launchpad.net/zeitgeist/"
/var/lib/archbuild/extra-staging-with-build-support-i686/build/build/zeitgeist/src/zeitgeist/config.log:| #define PACKAGE "zeitgeist"
/var/lib/archbuild/extra-staging-with-build-support-i686/build/build/zeitgeist/src/zeitgeist/config.log:| #define VERSION "1.0.4"
/var/lib/archbuild/extra-staging-with-build-support-i686/build/build/zeitgeist/src/zeitgeist/config.log:| #define HAVE_STDIO_H 1
/var/lib/archbuild/extra-staging-with-build-support-i686/build/build/zeitgeist/src/zeitgeist/config.log:| #define HAVE_STDLIB_H 1
/var/lib/archbuild/extra-staging-with-build-support-i686/build/build/zeitgeist/src/zeitgeist/config.log:| #define HAVE_STRING_H 1
/var/lib/archbuild/extra-staging-with-build-support-i686/build/build/zeitgeist/src/zeitgeist/config.log:| #define HAVE_INTTYPES_H 1
/var/lib/archbuild/extra-staging-with-build-support-i686/build/build/zeitgeist/src/zeitgeist/config.log:| #define HAVE_STDINT_H 1
/var/lib/archbuild/extra-staging-with-build-support-i686/build/build/zeitgeist/src/zeitgeist/config.log:| #define HAVE_STRINGS_H 1
/var/lib/archbuild/extra-staging-with-build-support-i686/build/build/zeitgeist/src/zeitgeist/config.log:| #define HAVE_SYS_STAT_H 1
/var/lib/archbuild/extra-staging-with-build-support-i686/build/build/zeitgeist/src/zeitgeist/config.log:| #define HAVE_SYS_TYPES_H 1
/var/lib/archbuild/extra-staging-with-build-support-i686/build/build/zeitgeist/src/zeitgeist/config.log:| #define HAVE_UNISTD_H 1
/var/lib/archbuild/extra-staging-with-build-support-i686/build/build/zeitgeist/src/zeitgeist/config.log:| #define STDC_HEADERS 1
/var/lib/archbuild/extra-staging-with-build-support-i686/build/build/zeitgeist/src/zeitgeist/config.log:| #define HAVE_DLFCN_H 1
/var/lib/archbuild/extra-staging-with-build-support-i686/build/build/zeitgeist/src/zeitgeist/config.log:| #define LT_OBJDIR ".libs/"
/var/lib/archbuild/extra-staging-with-build-support-i686/build/build/zeitgeist/src/zeitgeist/config.log:| #define GETTEXT_PACKAGE "zeitgeist"
/var/lib/archbuild/extra-staging-with-build-support-i686/build/build/zeitgeist/src/zeitgeist/config.log:| /* end confdefs.h.  */
/var/lib/archbuild/extra-staging-with-build-support-i686/build/build/zeitgeist/src/zeitgeist/config.log:| #include <CoreFoundation/CFLocale.h>
/var/lib/archbuild/extra-staging-with-build-support-i686/build/build/zeitgeist/src/zeitgeist/config.log:| int
/var/lib/archbuild/extra-staging-with-build-support-i686/build/build/zeitgeist/src/zeitgeist/config.log:| main (void)
/var/lib/archbuild/extra-staging-with-build-support-i686/build/build/zeitgeist/src/zeitgeist/config.log:| {
/var/lib/archbuild/extra-staging-with-build-support-i686/build/build/zeitgeist/src/zeitgeist/config.log:| CFLocaleCopyPreferredLanguages();
/var/lib/archbuild/extra-staging-with-build-support-i686/build/build/zeitgeist/src/zeitgeist/config.log:|   ;
/var/lib/archbuild/extra-staging-with-build-support-i686/build/build/zeitgeist/src/zeitgeist/config.log:|   return 0;
/var/lib/archbuild/extra-staging-with-build-support-i686/build/build/zeitgeist/src/zeitgeist/config.log:| }
/var/lib/archbuild/extra-staging-with-build-support-i686/build/build/zeitgeist/src/zeitgeist/config.log:configure:21164: result: no
/var/lib/archbuild/extra-staging-with-build-support-i686/build/build/zeitgeist/src/zeitgeist/config.log:configure:21214: checking for GNU gettext in libc
/var/lib/archbuild/extra-staging-with-build-support-i686/build/build/zeitgeist/src/zeitgeist/config.log:configure:21244: gcc -o conftest -march=i686 -mtune=generic -O2 -pipe -fno-plt -fexceptions         -Wp,-D_FORTIFY_SOURCE=3 -Wformat -Werror=format-security         -fstack-clash-protection          -fno-omit-frame-pointer -mno-omit-leaf-frame-pointer -g -ffile-prefix-map=/build/zeitgeist/src=/usr/src/debug/zeitgeist -flto=auto  -Wl,-O1 -Wl,--sort-common -Wl,--as-needed -Wl,-z,relro -Wl,-z,now          -Wl,-z,pack-relative-relocs -flto=auto conftest.c  >&5
/var/lib/archbuild/extra-staging-with-build-support-i686/build/build/zeitgeist/src/zeitgeist/config.log:configure:21244: $? = 0
/var/lib/archbuild/extra-staging-with-build-support-i686/build/build/zeitgeist/src/zeitgeist/config.log:configure:21256: result: yes
/var/lib/archbuild/extra-staging-with-build-support-i686/build/build/zeitgeist/src/zeitgeist/config.log:configure:22196: checking whether to use NLS
/var/lib/archbuild/extra-staging-with-build-support-i686/build/build/zeitgeist/src/zeitgeist/config.log:configure:22198: result: yes
/var/lib/archbuild/extra-staging-with-build-support-i686/build/build/zeitgeist/src/zeitgeist/config.log:configure:22201: checking where the gettext function comes from
/var/lib/archbuild/extra-staging-with-build-support-i686/build/build/zeitgeist/src/zeitgeist/config.log:configure:22212: result: libc
/var/lib/archbuild/extra-staging-with-build-support-i686/build/build/zeitgeist/src/zeitgeist/config.log:configure:22293: checking for glib-2.0 >= 2.35.4
/var/lib/archbuild/extra-staging-with-build-support-i686/build/build/zeitgeist/src/zeitgeist/config.log:                    gobject-2.0 >= 2.35.4
/var/lib/archbuild/extra-staging-with-build-support-i686/build/build/zeitgeist/src/zeitgeist/config.log:                    gmodule-2.0 >= 2.35.4
/var/lib/archbuild/extra-staging-with-build-support-i686/build/build/zeitgeist/src/zeitgeist/config.log:                    gio-unix-2.0 >= 2.35.4
/var/lib/archbuild/extra-staging-with-build-support-i686/build/build/zeitgeist/src/zeitgeist/config.log:                    sqlite3 >= 3.7.11
/var/lib/archbuild/extra-staging-with-build-support-i686/build/build/zeitgeist/src/zeitgeist/config.log:configure:22300: $PKG_CONFIG --exists --print-errors "$ZEITGEIST_REQUIRED"
/var/lib/archbuild/extra-staging-with-build-support-i686/build/build/zeitgeist/src/zeitgeist/config.log:configure:22303: $? = 0
/var/lib/archbuild/extra-staging-with-build-support-i686/build/build/zeitgeist/src/zeitgeist/config.log:configure:22317: $PKG_CONFIG --exists --print-errors "$ZEITGEIST_REQUIRED"
/var/lib/archbuild/extra-staging-with-build-support-i686/build/build/zeitgeist/src/zeitgeist/config.log:configure:22320: $? = 0
/var/lib/archbuild/extra-staging-with-build-support-i686/build/build/zeitgeist/src/zeitgeist/config.log:configure:22378: result: yes
/var/lib/archbuild/extra-staging-with-build-support-i686/build/build/zeitgeist/src/zeitgeist/config.log:configure:22405: $PKG_CONFIG --exists --print-errors "dee-icu-1.0 >= $DEE_ICU_REQUIRED"
/var/lib/archbuild/extra-staging-with-build-support-i686/build/build/zeitgeist/src/zeitgeist/config.log:Package dee-icu-1.0 was not found in the pkg-config search path.
/var/lib/archbuild/extra-staging-with-build-support-i686/build/build/zeitgeist/src/zeitgeist/config.log:Perhaps you should add the directory containing `dee-icu-1.0.pc'
/var/lib/archbuild/extra-staging-with-build-support-i686/build/build/zeitgeist/src/zeitgeist/config.log:to the PKG_CONFIG_PATH environment variable
/var/lib/archbuild/extra-staging-with-build-support-i686/build/build/zeitgeist/src/zeitgeist/config.log:Package 'dee-icu-1.0' not found
/var/lib/archbuild/extra-staging-with-build-support-i686/build/build/zeitgeist/src/zeitgeist/config.log:configure:22408: $? = 1
/var/lib/archbuild/extra-staging-with-build-support-i686/build/build/zeitgeist/src/zeitgeist/config.log:configure:22572: checking for xapian-config
/var/lib/archbuild/extra-staging-with-build-support-i686/build/build/zeitgeist/src/zeitgeist/config.log:configure:22593: found /usr/bin/xapian-config
/var/lib/archbuild/extra-staging-with-build-support-i686/build/build/zeitgeist/src/zeitgeist/config.log:configure:22606: result: yes
/var/lib/archbuild/extra-staging-with-build-support-i686/build/build/zeitgeist/src/zeitgeist/config.log:configure:22674: checking for telepathy-glib >= 0.18.0
/var/lib/archbuild/extra-staging-with-build-support-i686/build/build/zeitgeist/src/zeitgeist/config.log:configure:22681: $PKG_CONFIG --exists --print-errors "telepathy-glib >= $TELEPATHY_GLIB_REQUIRED"
/var/lib/archbuild/extra-staging-with-build-support-i686/build/build/zeitgeist/src/zeitgeist/config.log:configure:22684: $? = 0
/var/lib/archbuild/extra-staging-with-build-support-i686/build/build/zeitgeist/src/zeitgeist/config.log:configure:22698: $PKG_CONFIG --exists --print-errors "telepathy-glib >= $TELEPATHY_GLIB_REQUIRED"
/var/lib/archbuild/extra-staging-with-build-support-i686/build/build/zeitgeist/src/zeitgeist/config.log:configure:22701: $? = 0
/var/lib/archbuild/extra-staging-with-build-support-i686/build/build/zeitgeist/src/zeitgeist/config.log:configure:22759: result: yes
/var/lib/archbuild/extra-staging-with-build-support-i686/build/build/zeitgeist/src/zeitgeist/config.log:configure:22809: checking for glib-2.0 >= 2.35.4
/var/lib/archbuild/extra-staging-with-build-support-i686/build/build/zeitgeist/src/zeitgeist/config.log:                            gobject-2.0 >= 2.35.4
/var/lib/archbuild/extra-staging-with-build-support-i686/build/build/zeitgeist/src/zeitgeist/config.log:                            gio-2.0 >= 2.35.4
/var/lib/archbuild/extra-staging-with-build-support-i686/build/build/zeitgeist/src/zeitgeist/config.log:                            gio-unix-2.0 >= 2.35.4
/var/lib/archbuild/extra-staging-with-build-support-i686/build/build/zeitgeist/src/zeitgeist/config.log:                            gtk+-3.0 >= 3.0.0
/var/lib/archbuild/extra-staging-with-build-support-i686/build/build/zeitgeist/src/zeitgeist/config.log:                            json-glib-1.0 >= 0.14.0 telepathy-glib >= 0.18.0
/var/lib/archbuild/extra-staging-with-build-support-i686/build/build/zeitgeist/src/zeitgeist/config.log:configure:22816: $PKG_CONFIG --exists --print-errors "$ZEITGEIST_DATAHUB_REQUIRED"
/var/lib/archbuild/extra-staging-with-build-support-i686/build/build/zeitgeist/src/zeitgeist/config.log:configure:22819: $? = 0
/var/lib/archbuild/extra-staging-with-build-support-i686/build/build/zeitgeist/src/zeitgeist/config.log:configure:22833: $PKG_CONFIG --exists --print-errors "$ZEITGEIST_DATAHUB_REQUIRED"
/var/lib/archbuild/extra-staging-with-build-support-i686/build/build/zeitgeist/src/zeitgeist/config.log:configure:22836: $? = 0
/var/lib/archbuild/extra-staging-with-build-support-i686/build/build/zeitgeist/src/zeitgeist/config.log:configure:22894: result: yes
/var/lib/archbuild/extra-staging-with-build-support-i686/build/build/zeitgeist/src/zeitgeist/config.log:configure:23097: checking for gobject-introspection
/var/lib/archbuild/extra-staging-with-build-support-i686/build/build/zeitgeist/src/zeitgeist/config.log:configure:23106: $PKG_CONFIG --exists --print-errors "gobject-introspection-1.0"
/var/lib/archbuild/extra-staging-with-build-support-i686/build/build/zeitgeist/src/zeitgeist/config.log:configure:23109: $? = 0
/var/lib/archbuild/extra-staging-with-build-support-i686/build/build/zeitgeist/src/zeitgeist/config.log:configure:23116: $PKG_CONFIG --exists --print-errors "gobject-introspection-1.0 >= 1.30"
/var/lib/archbuild/extra-staging-with-build-support-i686/build/build/zeitgeist/src/zeitgeist/config.log:configure:23119: $? = 0
/var/lib/archbuild/extra-staging-with-build-support-i686/build/build/zeitgeist/src/zeitgeist/config.log:configure:23143: result: yes
/var/lib/archbuild/extra-staging-with-build-support-i686/build/build/zeitgeist/src/zeitgeist/config.log:configure:23244: checking for python3-rdflib
/var/lib/archbuild/extra-staging-with-build-support-i686/build/build/zeitgeist/src/zeitgeist/config.log:configure:23248: error: in '/build/zeitgeist/src/zeitgeist':
/var/lib/archbuild/extra-staging-with-build-support-i686/build/build/zeitgeist/src/zeitgeist/config.log:configure:23250: error: failed.  Please install the python3-rdflib package.
/var/lib/archbuild/extra-staging-with-build-support-i686/build/build/zeitgeist/src/zeitgeist/config.log:See 'config.log' for more details
/var/lib/archbuild/extra-staging-with-build-support-i686/build/build/zeitgeist/src/zeitgeist/config.log:
/var/lib/archbuild/extra-staging-with-build-support-i686/build/build/zeitgeist/src/zeitgeist/config.log:## ---------------- ##
/var/lib/archbuild/extra-staging-with-build-support-i686/build/build/zeitgeist/src/zeitgeist/config.log:## Cache variables. ##
/var/lib/archbuild/extra-staging-with-build-support-i686/build/build/zeitgeist/src/zeitgeist/config.log:## ---------------- ##
/var/lib/archbuild/extra-staging-with-build-support-i686/build/build/zeitgeist/src/zeitgeist/config.log:
/var/lib/archbuild/extra-staging-with-build-support-i686/build/build/zeitgeist/src/zeitgeist/config.log:ac_cv_build=i686-pc-linux-gnu
/var/lib/archbuild/extra-staging-with-build-support-i686/build/build/zeitgeist/src/zeitgeist/config.log:ac_cv_c_compiler_gnu=yes
/var/lib/archbuild/extra-staging-with-build-support-i686/build/build/zeitgeist/src/zeitgeist/config.log:ac_cv_cxx_compiler_gnu=yes
/var/lib/archbuild/extra-staging-with-build-support-i686/build/build/zeitgeist/src/zeitgeist/config.log:ac_cv_env_CCC_set=
/var/lib/archbuild/extra-staging-with-build-support-i686/build/build/zeitgeist/src/zeitgeist/config.log:ac_cv_env_CCC_value=
/var/lib/archbuild/extra-staging-with-build-support-i686/build/build/zeitgeist/src/zeitgeist/config.log:ac_cv_env_CC_set=
/var/lib/archbuild/extra-staging-with-build-support-i686/build/build/zeitgeist/src/zeitgeist/config.log:ac_cv_env_CC_value=
/var/lib/archbuild/extra-staging-with-build-support-i686/build/build/zeitgeist/src/zeitgeist/config.log:ac_cv_env_CFLAGS_set=set
/var/lib/archbuild/extra-staging-with-build-support-i686/build/build/zeitgeist/src/zeitgeist/config.log:ac_cv_env_CFLAGS_value='-march=i686 -mtune=generic -O2 -pipe -fno-plt -fexceptions         -Wp,-D_FORTIFY_SOURCE=3 -Wformat -Werror=format-security         -fstack-clash-protection          -fno-omit-frame-pointer -mno-omit-leaf-frame-pointer -g -ffile-prefix-map=/build/zeitgeist/src=/usr/src/debug/zeitgeist -flto=auto'
/var/lib/archbuild/extra-staging-with-build-support-i686/build/build/zeitgeist/src/zeitgeist/config.log:ac_cv_env_CPPFLAGS_set=
/var/lib/archbuild/extra-staging-with-build-support-i686/build/build/zeitgeist/src/zeitgeist/config.log:ac_cv_env_CPPFLAGS_value=
/var/lib/archbuild/extra-staging-with-build-support-i686/build/build/zeitgeist/src/zeitgeist/config.log:ac_cv_env_CPP_set=
/var/lib/archbuild/extra-staging-with-build-support-i686/build/build/zeitgeist/src/zeitgeist/config.log:ac_cv_env_CPP_value=
/var/lib/archbuild/extra-staging-with-build-support-i686/build/build/zeitgeist/src/zeitgeist/config.log:ac_cv_env_CXXCPP_set=
/var/lib/archbuild/extra-staging-with-build-support-i686/build/build/zeitgeist/src/zeitgeist/config.log:ac_cv_env_CXXCPP_value=
/var/lib/archbuild/extra-staging-with-build-support-i686/build/build/zeitgeist/src/zeitgeist/config.log:ac_cv_env_CXXFLAGS_set=set
/var/lib/archbuild/extra-staging-with-build-support-i686/build/build/zeitgeist/src/zeitgeist/config.log:ac_cv_env_CXXFLAGS_value='-march=i686 -mtune=generic -O2 -pipe -fno-plt -fexceptions         -Wp,-D_FORTIFY_SOURCE=3 -Wformat -Werror=format-security         -fstack-clash-protection          -fno-omit-frame-pointer -mno-omit-leaf-frame-pointer -Wp,-D_GLIBCXX_ASSERTIONS -g -ffile-prefix-map=/build/zeitgeist/src=/usr/src/debug/zeitgeist -flto=auto'
/var/lib/archbuild/extra-staging-with-build-support-i686/build/build/zeitgeist/src/zeitgeist/config.log:ac_cv_env_CXX_set=
/var/lib/archbuild/extra-staging-with-build-support-i686/build/build/zeitgeist/src/zeitgeist/config.log:ac_cv_env_CXX_value=
/var/lib/archbuild/extra-staging-with-build-support-i686/build/build/zeitgeist/src/zeitgeist/config.log:ac_cv_env_DEE_ICU_CFLAGS_set=
/var/lib/archbuild/extra-staging-with-build-support-i686/build/build/zeitgeist/src/zeitgeist/config.log:ac_cv_env_DEE_ICU_CFLAGS_value=
/var/lib/archbuild/extra-staging-with-build-support-i686/build/build/zeitgeist/src/zeitgeist/config.log:ac_cv_env_DEE_ICU_LIBS_set=
/var/lib/archbuild/extra-staging-with-build-support-i686/build/build/zeitgeist/src/zeitgeist/config.log:ac_cv_env_DEE_ICU_LIBS_value=
/var/lib/archbuild/extra-staging-with-build-support-i686/build/build/zeitgeist/src/zeitgeist/config.log:ac_cv_env_LDFLAGS_set=set
/var/lib/archbuild/extra-staging-with-build-support-i686/build/build/zeitgeist/src/zeitgeist/config.log:ac_cv_env_LDFLAGS_value='-Wl,-O1 -Wl,--sort-common -Wl,--as-needed -Wl,-z,relro -Wl,-z,now          -Wl,-z,pack-relative-relocs -flto=auto'
/var/lib/archbuild/extra-staging-with-build-support-i686/build/build/zeitgeist/src/zeitgeist/config.log:ac_cv_env_LIBS_set=
/var/lib/archbuild/extra-staging-with-build-support-i686/build/build/zeitgeist/src/zeitgeist/config.log:ac_cv_env_LIBS_value=
/var/lib/archbuild/extra-staging-with-build-support-i686/build/build/zeitgeist/src/zeitgeist/config.log:ac_cv_env_LT_SYS_LIBRARY_PATH_set=
/var/lib/archbuild/extra-staging-with-build-support-i686/build/build/zeitgeist/src/zeitgeist/config.log:ac_cv_env_LT_SYS_LIBRARY_PATH_value=
/var/lib/archbuild/extra-staging-with-build-support-i686/build/build/zeitgeist/src/zeitgeist/config.log:ac_cv_env_PKG_CONFIG_LIBDIR_set=
/var/lib/archbuild/extra-staging-with-build-support-i686/build/build/zeitgeist/src/zeitgeist/config.log:ac_cv_env_PKG_CONFIG_LIBDIR_value=
/var/lib/archbuild/extra-staging-with-build-support-i686/build/build/zeitgeist/src/zeitgeist/config.log:ac_cv_env_PKG_CONFIG_PATH_set=
/var/lib/archbuild/extra-staging-with-build-support-i686/build/build/zeitgeist/src/zeitgeist/config.log:ac_cv_env_PKG_CONFIG_PATH_value=
/var/lib/archbuild/extra-staging-with-build-support-i686/build/build/zeitgeist/src/zeitgeist/config.log:ac_cv_env_PKG_CONFIG_set=
/var/lib/archbuild/extra-staging-with-build-support-i686/build/build/zeitgeist/src/zeitgeist/config.log:ac_cv_env_PKG_CONFIG_value=
/var/lib/archbuild/extra-staging-with-build-support-i686/build/build/zeitgeist/src/zeitgeist/config.log:ac_cv_env_PYTHON_set=
/var/lib/archbuild/extra-staging-with-build-support-i686/build/build/zeitgeist/src/zeitgeist/config.log:ac_cv_env_PYTHON_value=
/var/lib/archbuild/extra-staging-with-build-support-i686/build/build/zeitgeist/src/zeitgeist/config.log:ac_cv_env_TELEPATHY_GLIB_CFLAGS_set=
/var/lib/archbuild/extra-staging-with-build-support-i686/build/build/zeitgeist/src/zeitgeist/config.log:ac_cv_env_TELEPATHY_GLIB_CFLAGS_value=
/var/lib/archbuild/extra-staging-with-build-support-i686/build/build/zeitgeist/src/zeitgeist/config.log:ac_cv_env_TELEPATHY_GLIB_LIBS_set=
/var/lib/archbuild/extra-staging-with-build-support-i686/build/build/zeitgeist/src/zeitgeist/config.log:ac_cv_env_TELEPATHY_GLIB_LIBS_value=
/var/lib/archbuild/extra-staging-with-build-support-i686/build/build/zeitgeist/src/zeitgeist/config.log:ac_cv_env_ZEITGEIST_CFLAGS_set=
/var/lib/archbuild/extra-staging-with-build-support-i686/build/build/zeitgeist/src/zeitgeist/config.log:ac_cv_env_ZEITGEIST_CFLAGS_value=
/var/lib/archbuild/extra-staging-with-build-support-i686/build/build/zeitgeist/src/zeitgeist/config.log:ac_cv_env_ZEITGEIST_DATAHUB_CFLAGS_set=
/var/lib/archbuild/extra-staging-with-build-support-i686/build/build/zeitgeist/src/zeitgeist/config.log:ac_cv_env_ZEITGEIST_DATAHUB_CFLAGS_value=
/var/lib/archbuild/extra-staging-with-build-support-i686/build/build/zeitgeist/src/zeitgeist/config.log:ac_cv_env_ZEITGEIST_DATAHUB_LIBS_set=
/var/lib/archbuild/extra-staging-with-build-support-i686/build/build/zeitgeist/src/zeitgeist/config.log:ac_cv_env_ZEITGEIST_DATAHUB_LIBS_value=
/var/lib/archbuild/extra-staging-with-build-support-i686/build/build/zeitgeist/src/zeitgeist/config.log:ac_cv_env_ZEITGEIST_LIBS_set=
/var/lib/archbuild/extra-staging-with-build-support-i686/build/build/zeitgeist/src/zeitgeist/config.log:ac_cv_env_ZEITGEIST_LIBS_value=
/var/lib/archbuild/extra-staging-with-build-support-i686/build/build/zeitgeist/src/zeitgeist/config.log:ac_cv_env_build_alias_set=
/var/lib/archbuild/extra-staging-with-build-support-i686/build/build/zeitgeist/src/zeitgeist/config.log:ac_cv_env_build_alias_value=
/var/lib/archbuild/extra-staging-with-build-support-i686/build/build/zeitgeist/src/zeitgeist/config.log:ac_cv_env_host_alias_set=
/var/lib/archbuild/extra-staging-with-build-support-i686/build/build/zeitgeist/src/zeitgeist/config.log:ac_cv_env_host_alias_value=
/var/lib/archbuild/extra-staging-with-build-support-i686/build/build/zeitgeist/src/zeitgeist/config.log:ac_cv_env_target_alias_set=
/var/lib/archbuild/extra-staging-with-build-support-i686/build/build/zeitgeist/src/zeitgeist/config.log:ac_cv_env_target_alias_value=
/var/lib/archbuild/extra-staging-with-build-support-i686/build/build/zeitgeist/src/zeitgeist/config.log:ac_cv_header_dlfcn_h=yes
/var/lib/archbuild/extra-staging-with-build-support-i686/build/build/zeitgeist/src/zeitgeist/config.log:ac_cv_header_inttypes_h=yes
/var/lib/archbuild/extra-staging-with-build-support-i686/build/build/zeitgeist/src/zeitgeist/config.log:ac_cv_header_stdint_h=yes
/var/lib/archbuild/extra-staging-with-build-support-i686/build/build/zeitgeist/src/zeitgeist/config.log:ac_cv_header_stdio_h=yes
/var/lib/archbuild/extra-staging-with-build-support-i686/build/build/zeitgeist/src/zeitgeist/config.log:ac_cv_header_stdlib_h=yes
/var/lib/archbuild/extra-staging-with-build-support-i686/build/build/zeitgeist/src/zeitgeist/config.log:ac_cv_header_string_h=yes
/var/lib/archbuild/extra-staging-with-build-support-i686/build/build/zeitgeist/src/zeitgeist/config.log:ac_cv_header_strings_h=yes
/var/lib/archbuild/extra-staging-with-build-support-i686/build/build/zeitgeist/src/zeitgeist/config.log:ac_cv_header_sys_stat_h=yes
/var/lib/archbuild/extra-staging-with-build-support-i686/build/build/zeitgeist/src/zeitgeist/config.log:ac_cv_header_sys_types_h=yes
/var/lib/archbuild/extra-staging-with-build-support-i686/build/build/zeitgeist/src/zeitgeist/config.log:ac_cv_header_unistd_h=yes
/var/lib/archbuild/extra-staging-with-build-support-i686/build/build/zeitgeist/src/zeitgeist/config.log:ac_cv_host=i686-pc-linux-gnu
/var/lib/archbuild/extra-staging-with-build-support-i686/build/build/zeitgeist/src/zeitgeist/config.log:ac_cv_objext=o
/var/lib/archbuild/extra-staging-with-build-support-i686/build/build/zeitgeist/src/zeitgeist/config.log:ac_cv_path_EGREP='/usr/bin/grep -E'
/var/lib/archbuild/extra-staging-with-build-support-i686/build/build/zeitgeist/src/zeitgeist/config.log:ac_cv_path_EGREP_TRADITIONAL='/usr/bin/grep -E'
/var/lib/archbuild/extra-staging-with-build-support-i686/build/build/zeitgeist/src/zeitgeist/config.log:ac_cv_path_FGREP='/usr/bin/grep -F'
/var/lib/archbuild/extra-staging-with-build-support-i686/build/build/zeitgeist/src/zeitgeist/config.log:ac_cv_path_GMSGFMT=/usr/bin/msgfmt
/var/lib/archbuild/extra-staging-with-build-support-i686/build/build/zeitgeist/src/zeitgeist/config.log:ac_cv_path_GREP=/usr/bin/grep
/var/lib/archbuild/extra-staging-with-build-support-i686/build/build/zeitgeist/src/zeitgeist/config.log:ac_cv_path_MSGFMT=/usr/bin/msgfmt
/var/lib/archbuild/extra-staging-with-build-support-i686/build/build/zeitgeist/src/zeitgeist/config.log:ac_cv_path_MSGMERGE=/usr/bin/msgmerge
/var/lib/archbuild/extra-staging-with-build-support-i686/build/build/zeitgeist/src/zeitgeist/config.log:ac_cv_path_PYTHON=/usr/bin/python
/var/lib/archbuild/extra-staging-with-build-support-i686/build/build/zeitgeist/src/zeitgeist/config.log:ac_cv_path_SED=/usr/bin/sed
/var/lib/archbuild/extra-staging-with-build-support-i686/build/build/zeitgeist/src/zeitgeist/config.log:ac_cv_path_VALAC=/usr/bin/valac
/var/lib/archbuild/extra-staging-with-build-support-i686/build/build/zeitgeist/src/zeitgeist/config.log:ac_cv_path_XGETTEXT=/usr/bin/xgettext
/var/lib/archbuild/extra-staging-with-build-support-i686/build/build/zeitgeist/src/zeitgeist/config.log:ac_cv_path_ac_pt_PKG_CONFIG=/usr/bin/pkg-config
/var/lib/archbuild/extra-staging-with-build-support-i686/build/build/zeitgeist/src/zeitgeist/config.log:ac_cv_path_install='/usr/bin/install -c'
/var/lib/archbuild/extra-staging-with-build-support-i686/build/build/zeitgeist/src/zeitgeist/config.log:ac_cv_path_lt_DD=/usr/bin/dd
/var/lib/archbuild/extra-staging-with-build-support-i686/build/build/zeitgeist/src/zeitgeist/config.log:ac_cv_path_mkdir=/usr/bin/mkdir
/var/lib/archbuild/extra-staging-with-build-support-i686/build/build/zeitgeist/src/zeitgeist/config.log:ac_cv_prog_AWK=gawk
/var/lib/archbuild/extra-staging-with-build-support-i686/build/build/zeitgeist/src/zeitgeist/config.log:ac_cv_prog_CPP='gcc -E'
/var/lib/archbuild/extra-staging-with-build-support-i686/build/build/zeitgeist/src/zeitgeist/config.log:ac_cv_prog_CXXCPP='g++ -E'
/var/lib/archbuild/extra-staging-with-build-support-i686/build/build/zeitgeist/src/zeitgeist/config.log:ac_cv_prog_FILECMD=file
/var/lib/archbuild/extra-staging-with-build-support-i686/build/build/zeitgeist/src/zeitgeist/config.log:ac_cv_prog_HAVE_XAPIAN=yes
/var/lib/archbuild/extra-staging-with-build-support-i686/build/build/zeitgeist/src/zeitgeist/config.log:ac_cv_prog_ac_ct_AR=ar
/var/lib/archbuild/extra-staging-with-build-support-i686/build/build/zeitgeist/src/zeitgeist/config.log:ac_cv_prog_ac_ct_CC=gcc
/var/lib/archbuild/extra-staging-with-build-support-i686/build/build/zeitgeist/src/zeitgeist/config.log:ac_cv_prog_ac_ct_CXX=g++
/var/lib/archbuild/extra-staging-with-build-support-i686/build/build/zeitgeist/src/zeitgeist/config.log:ac_cv_prog_ac_ct_OBJDUMP=objdump
/var/lib/archbuild/extra-staging-with-build-support-i686/build/build/zeitgeist/src/zeitgeist/config.log:ac_cv_prog_ac_ct_RANLIB=ranlib
/var/lib/archbuild/extra-staging-with-build-support-i686/build/build/zeitgeist/src/zeitgeist/config.log:ac_cv_prog_ac_ct_STRIP=strip
/var/lib/archbuild/extra-staging-with-build-support-i686/build/build/zeitgeist/src/zeitgeist/config.log:ac_cv_prog_cc_c11=
/var/lib/archbuild/extra-staging-with-build-support-i686/build/build/zeitgeist/src/zeitgeist/config.log:ac_cv_prog_cc_g=yes
/var/lib/archbuild/extra-staging-with-build-support-i686/build/build/zeitgeist/src/zeitgeist/config.log:ac_cv_prog_cc_stdc=
/var/lib/archbuild/extra-staging-with-build-support-i686/build/build/zeitgeist/src/zeitgeist/config.log:ac_cv_prog_cxx_c_o=yes
/var/lib/archbuild/extra-staging-with-build-support-i686/build/build/zeitgeist/src/zeitgeist/config.log:ac_cv_prog_cxx_cxx11=
/var/lib/archbuild/extra-staging-with-build-support-i686/build/build/zeitgeist/src/zeitgeist/config.log:ac_cv_prog_cxx_g=yes
/var/lib/archbuild/extra-staging-with-build-support-i686/build/build/zeitgeist/src/zeitgeist/config.log:ac_cv_prog_cxx_stdcxx=
/var/lib/archbuild/extra-staging-with-build-support-i686/build/build/zeitgeist/src/zeitgeist/config.log:ac_cv_prog_make_make_set=yes
/var/lib/archbuild/extra-staging-with-build-support-i686/build/build/zeitgeist/src/zeitgeist/config.log:acl_cv_hardcode_direct=no
/var/lib/archbuild/extra-staging-with-build-support-i686/build/build/zeitgeist/src/zeitgeist/config.log:acl_cv_hardcode_libdir_flag_spec='${wl}-rpath ${wl}$libdir'
/var/lib/archbuild/extra-staging-with-build-support-i686/build/build/zeitgeist/src/zeitgeist/config.log:acl_cv_hardcode_libdir_separator=
/var/lib/archbuild/extra-staging-with-build-support-i686/build/build/zeitgeist/src/zeitgeist/config.log:acl_cv_hardcode_minus_L=no
/var/lib/archbuild/extra-staging-with-build-support-i686/build/build/zeitgeist/src/zeitgeist/config.log:acl_cv_libdirstems=lib,lib,lib
/var/lib/archbuild/extra-staging-with-build-support-i686/build/build/zeitgeist/src/zeitgeist/config.log:acl_cv_libext=a
/var/lib/archbuild/extra-staging-with-build-support-i686/build/build/zeitgeist/src/zeitgeist/config.log:acl_cv_libname_spec='lib$name'
/var/lib/archbuild/extra-staging-with-build-support-i686/build/build/zeitgeist/src/zeitgeist/config.log:acl_cv_library_names_spec='$libname$shrext'
/var/lib/archbuild/extra-staging-with-build-support-i686/build/build/zeitgeist/src/zeitgeist/config.log:acl_cv_prog_gnu_ld=yes
/var/lib/archbuild/extra-staging-with-build-support-i686/build/build/zeitgeist/src/zeitgeist/config.log:acl_cv_rpath=done
/var/lib/archbuild/extra-staging-with-build-support-i686/build/build/zeitgeist/src/zeitgeist/config.log:acl_cv_shlibext=so
/var/lib/archbuild/extra-staging-with-build-support-i686/build/build/zeitgeist/src/zeitgeist/config.log:acl_cv_wl=-Wl,
/var/lib/archbuild/extra-staging-with-build-support-i686/build/build/zeitgeist/src/zeitgeist/config.log:am_cv_CC_dependencies_compiler_type=gcc3
/var/lib/archbuild/extra-staging-with-build-support-i686/build/build/zeitgeist/src/zeitgeist/config.log:am_cv_CXX_dependencies_compiler_type=gcc3
/var/lib/archbuild/extra-staging-with-build-support-i686/build/build/zeitgeist/src/zeitgeist/config.log:am_cv_filesystem_timestamp_resolution=0.01
/var/lib/archbuild/extra-staging-with-build-support-i686/build/build/zeitgeist/src/zeitgeist/config.log:am_cv_make_support_nested_variables=yes
/var/lib/archbuild/extra-staging-with-build-support-i686/build/build/zeitgeist/src/zeitgeist/config.log:am_cv_pathless_PYTHON=python
/var/lib/archbuild/extra-staging-with-build-support-i686/build/build/zeitgeist/src/zeitgeist/config.log:am_cv_prog_cc_c_o=yes
/var/lib/archbuild/extra-staging-with-build-support-i686/build/build/zeitgeist/src/zeitgeist/config.log:am_cv_prog_tar_ustar=gnutar
/var/lib/archbuild/extra-staging-with-build-support-i686/build/build/zeitgeist/src/zeitgeist/config.log:am_cv_python_platform=linux
/var/lib/archbuild/extra-staging-with-build-support-i686/build/build/zeitgeist/src/zeitgeist/config.log:am_cv_python_pyexecdir='${PYTHON_EXEC_PREFIX}/lib/python3.13/site-packages'
/var/lib/archbuild/extra-staging-with-build-support-i686/build/build/zeitgeist/src/zeitgeist/config.log:am_cv_python_pythondir='${PYTHON_PREFIX}/lib/python3.13/site-packages'
/var/lib/archbuild/extra-staging-with-build-support-i686/build/build/zeitgeist/src/zeitgeist/config.log:am_cv_python_version=3.13
/var/lib/archbuild/extra-staging-with-build-support-i686/build/build/zeitgeist/src/zeitgeist/config.log:am_cv_sleep_fractional_seconds=yes
/var/lib/archbuild/extra-staging-with-build-support-i686/build/build/zeitgeist/src/zeitgeist/config.log:am_cv_xargs_n_works=yes
/var/lib/archbuild/extra-staging-with-build-support-i686/build/build/zeitgeist/src/zeitgeist/config.log:gl_cv_elf=yes
/var/lib/archbuild/extra-staging-with-build-support-i686/build/build/zeitgeist/src/zeitgeist/config.log:gl_cv_host_cpu_c_abi_32bit=yes
/var/lib/archbuild/extra-staging-with-build-support-i686/build/build/zeitgeist/src/zeitgeist/config.log:gt_cv_func_CFLocaleCopyPreferredLanguages=no
/var/lib/archbuild/extra-staging-with-build-support-i686/build/build/zeitgeist/src/zeitgeist/config.log:gt_cv_func_CFPreferencesCopyAppValue=no
/var/lib/archbuild/extra-staging-with-build-support-i686/build/build/zeitgeist/src/zeitgeist/config.log:gt_cv_func_gnugettext1_libc=yes
/var/lib/archbuild/extra-staging-with-build-support-i686/build/build/zeitgeist/src/zeitgeist/config.log:lt_cv_ar_at_file=@
/var/lib/archbuild/extra-staging-with-build-support-i686/build/build/zeitgeist/src/zeitgeist/config.log:lt_cv_archive_cmds_need_lc=no
/var/lib/archbuild/extra-staging-with-build-support-i686/build/build/zeitgeist/src/zeitgeist/config.log:lt_cv_deplibs_check_method=pass_all
/var/lib/archbuild/extra-staging-with-build-support-i686/build/build/zeitgeist/src/zeitgeist/config.log:lt_cv_file_magic_cmd='$MAGIC_CMD'
/var/lib/archbuild/extra-staging-with-build-support-i686/build/build/zeitgeist/src/zeitgeist/config.log:lt_cv_file_magic_test_file=
/var/lib/archbuild/extra-staging-with-build-support-i686/build/build/zeitgeist/src/zeitgeist/config.log:lt_cv_ld_reload_flag=-r
/var/lib/archbuild/extra-staging-with-build-support-i686/build/build/zeitgeist/src/zeitgeist/config.log:lt_cv_nm_interface='BSD nm'
/var/lib/archbuild/extra-staging-with-build-support-i686/build/build/zeitgeist/src/zeitgeist/config.log:lt_cv_objdir=.libs
/var/lib/archbuild/extra-staging-with-build-support-i686/build/build/zeitgeist/src/zeitgeist/config.log:lt_cv_path_LD=/usr/bin/ld
/var/lib/archbuild/extra-staging-with-build-support-i686/build/build/zeitgeist/src/zeitgeist/config.log:lt_cv_path_LDCXX=/usr/bin/ld
/var/lib/archbuild/extra-staging-with-build-support-i686/build/build/zeitgeist/src/zeitgeist/config.log:lt_cv_path_NM='/usr/bin/nm -B'
/var/lib/archbuild/extra-staging-with-build-support-i686/build/build/zeitgeist/src/zeitgeist/config.log:lt_cv_path_manifest_tool=no
/var/lib/archbuild/extra-staging-with-build-support-i686/build/build/zeitgeist/src/zeitgeist/config.log:lt_cv_prog_compiler_c_o=yes
/var/lib/archbuild/extra-staging-with-build-support-i686/build/build/zeitgeist/src/zeitgeist/config.log:lt_cv_prog_compiler_c_o_CXX=yes
/var/lib/archbuild/extra-staging-with-build-support-i686/build/build/zeitgeist/src/zeitgeist/config.log:lt_cv_prog_compiler_pic='-fPIC -DPIC'
/var/lib/archbuild/extra-staging-with-build-support-i686/build/build/zeitgeist/src/zeitgeist/config.log:lt_cv_prog_compiler_pic_CXX='-fPIC -DPIC'
/var/lib/archbuild/extra-staging-with-build-support-i686/build/build/zeitgeist/src/zeitgeist/config.log:lt_cv_prog_compiler_pic_works=yes
/var/lib/archbuild/extra-staging-with-build-support-i686/build/build/zeitgeist/src/zeitgeist/config.log:lt_cv_prog_compiler_pic_works_CXX=yes
/var/lib/archbuild/extra-staging-with-build-support-i686/build/build/zeitgeist/src/zeitgeist/config.log:lt_cv_prog_compiler_rtti_exceptions=no
/var/lib/archbuild/extra-staging-with-build-support-i686/build/build/zeitgeist/src/zeitgeist/config.log:lt_cv_prog_compiler_static_works=yes
/var/lib/archbuild/extra-staging-with-build-support-i686/build/build/zeitgeist/src/zeitgeist/config.log:lt_cv_prog_compiler_static_works_CXX=yes
/var/lib/archbuild/extra-staging-with-build-support-i686/build/build/zeitgeist/src/zeitgeist/config.log:lt_cv_prog_gnu_ld=yes
/var/lib/archbuild/extra-staging-with-build-support-i686/build/build/zeitgeist/src/zeitgeist/config.log:lt_cv_prog_gnu_ldcxx=yes
/var/lib/archbuild/extra-staging-with-build-support-i686/build/build/zeitgeist/src/zeitgeist/config.log:lt_cv_sharedlib_from_linklib_cmd='printf %s\n'
/var/lib/archbuild/extra-staging-with-build-support-i686/build/build/zeitgeist/src/zeitgeist/config.log:lt_cv_shlibpath_overrides_runpath=yes
/var/lib/archbuild/extra-staging-with-build-support-i686/build/build/zeitgeist/src/zeitgeist/config.log:lt_cv_sys_global_symbol_pipe='/usr/bin/sed -n -e '\''s/^.*[	 ]\([ABCDGIRSTW][ABCDGIRSTW]*\)[	 ][	 ]*\([_A-Za-z][_A-Za-z0-9]*\)$/\1 \2 \2/p'\'' | /usr/bin/sed '\''/ __gnu_lto/d'\'''
/var/lib/archbuild/extra-staging-with-build-support-i686/build/build/zeitgeist/src/zeitgeist/config.log:lt_cv_sys_global_symbol_to_c_name_address='/usr/bin/sed -n -e '\''s/^: \(.*\) .*$/  {"\1", (void *) 0},/p'\'' -e '\''s/^[ABCDGIRSTW][ABCDGIRSTW]* .* \(.*\)$/  {"\1", (void *) \&\1},/p'\'''
/var/lib/archbuild/extra-staging-with-build-support-i686/build/build/zeitgeist/src/zeitgeist/config.log:lt_cv_sys_global_symbol_to_c_name_address_lib_prefix='/usr/bin/sed -n -e '\''s/^: \(.*\) .*$/  {"\1", (void *) 0},/p'\'' -e '\''s/^[ABCDGIRSTW][ABCDGIRSTW]* .* \(lib.*\)$/  {"\1", (void *) \&\1},/p'\'' -e '\''s/^[ABCDGIRSTW][ABCDGIRSTW]* .* \(.*\)$/  {"lib\1", (void *) \&\1},/p'\'''
/var/lib/archbuild/extra-staging-with-build-support-i686/build/build/zeitgeist/src/zeitgeist/config.log:lt_cv_sys_global_symbol_to_cdecl='/usr/bin/sed -n -e '\''s/^T .* \(.*\)$/extern int \1();/p'\'' -e '\''s/^[ABCDGIRSTW][ABCDGIRSTW]* .* \(.*\)$/extern char \1;/p'\'''
/var/lib/archbuild/extra-staging-with-build-support-i686/build/build/zeitgeist/src/zeitgeist/config.log:lt_cv_sys_global_symbol_to_import=
/var/lib/archbuild/extra-staging-with-build-support-i686/build/build/zeitgeist/src/zeitgeist/config.log:lt_cv_sys_max_cmd_len=1572864
/var/lib/archbuild/extra-staging-with-build-support-i686/build/build/zeitgeist/src/zeitgeist/config.log:lt_cv_to_host_file_cmd=func_convert_file_noop
/var/lib/archbuild/extra-staging-with-build-support-i686/build/build/zeitgeist/src/zeitgeist/config.log:lt_cv_to_tool_file_cmd=func_convert_file_noop
/var/lib/archbuild/extra-staging-with-build-support-i686/build/build/zeitgeist/src/zeitgeist/config.log:lt_cv_truncate_bin='/usr/bin/dd bs=4096 count=1'
/var/lib/archbuild/extra-staging-with-build-support-i686/build/build/zeitgeist/src/zeitgeist/config.log:pkg_cv_TELEPATHY_GLIB_CFLAGS='-I/usr/include/telepathy-1.0 -I/usr/include/dbus-1.0 -I/usr/lib/dbus-1.0/include -I/usr/include/glib-2.0 -I/usr/lib/glib-2.0/include -I/usr/include/libmount -I/usr/include/blkid -I/usr/include/sysprof-6 -pthread'
/var/lib/archbuild/extra-staging-with-build-support-i686/build/build/zeitgeist/src/zeitgeist/config.log:pkg_cv_TELEPATHY_GLIB_LIBS=-ltelepathy-glib
/var/lib/archbuild/extra-staging-with-build-support-i686/build/build/zeitgeist/src/zeitgeist/config.log:pkg_cv_ZEITGEIST_CFLAGS='-I/usr/include/gio-unix-2.0 -I/usr/include/glib-2.0 -I/usr/lib/glib-2.0/include -I/usr/include/libmount -I/usr/include/blkid -I/usr/include/sysprof-6 -pthread'
/var/lib/archbuild/extra-staging-with-build-support-i686/build/build/zeitgeist/src/zeitgeist/config.log:pkg_cv_ZEITGEIST_DATAHUB_CFLAGS='-I/usr/include/gtk-3.0 -I/usr/include/pango-1.0 -I/usr/include/cloudproviders -I/usr/include/cairo -I/usr/include/gdk-pixbuf-2.0 -I/usr/include/at-spi2-atk/2.0 -I/usr/include/at-spi-2.0 -I/usr/include/atk-1.0 -I/usr/include/fribidi -I/usr/include/pixman-1 -I/usr/include/harfbuzz -I/usr/include/freetype2 -I/usr/include/libpng16 -I/usr/include/gio-unix-2.0 -I/usr/include/json-glib-1.0 -I/usr/include/telepathy-1.0 -I/usr/include/dbus-1.0 -I/usr/lib/dbus-1.0/include -I/usr/include/glib-2.0 -I/usr/lib/glib-2.0/include -I/usr/include/libmount -I/usr/include/blkid -I/usr/include/sysprof-6 -pthread'
/var/lib/archbuild/extra-staging-with-build-support-i686/build/build/zeitgeist/src/zeitgeist/config.log:pkg_cv_ZEITGEIST_DATAHUB_LIBS='-lgtk-3 -lgdk-3 -lz -lpangocairo-1.0 -lpango-1.0 -lharfbuzz -latk-1.0 -lcairo-gobject -lcairo -lgdk_pixbuf-2.0 -ljson-glib-1.0 -lgio-2.0 -lgobject-2.0 -lglib-2.0 -ltelepathy-glib'
/var/lib/archbuild/extra-staging-with-build-support-i686/build/build/zeitgeist/src/zeitgeist/config.log:pkg_cv_ZEITGEIST_LIBS='-Wl,--export-dynamic -lgmodule-2.0 -pthread -lgio-2.0 -lgobject-2.0 -lglib-2.0 -lsqlite3'
/var/lib/archbuild/extra-staging-with-build-support-i686/build/build/zeitgeist/src/zeitgeist/config.log:
/var/lib/archbuild/extra-staging-with-build-support-i686/build/build/zeitgeist/src/zeitgeist/config.log:## ----------------- ##
/var/lib/archbuild/extra-staging-with-build-support-i686/build/build/zeitgeist/src/zeitgeist/config.log:## Output variables. ##
/var/lib/archbuild/extra-staging-with-build-support-i686/build/build/zeitgeist/src/zeitgeist/config.log:## ----------------- ##
/var/lib/archbuild/extra-staging-with-build-support-i686/build/build/zeitgeist/src/zeitgeist/config.log:
/var/lib/archbuild/extra-staging-with-build-support-i686/build/build/zeitgeist/src/zeitgeist/config.log:ACLOCAL='${SHELL} '\''/build/zeitgeist/src/zeitgeist/build-aux/missing'\'' aclocal-1.17'
/var/lib/archbuild/extra-staging-with-build-support-i686/build/build/zeitgeist/src/zeitgeist/config.log:AMDEPBACKSLASH='\'
/var/lib/archbuild/extra-staging-with-build-support-i686/build/build/zeitgeist/src/zeitgeist/config.log:AMDEP_FALSE='#'
/var/lib/archbuild/extra-staging-with-build-support-i686/build/build/zeitgeist/src/zeitgeist/config.log:AMDEP_TRUE=''
/var/lib/archbuild/extra-staging-with-build-support-i686/build/build/zeitgeist/src/zeitgeist/config.log:AMTAR='$${TAR-tar}'
/var/lib/archbuild/extra-staging-with-build-support-i686/build/build/zeitgeist/src/zeitgeist/config.log:AM_BACKSLASH='\'
/var/lib/archbuild/extra-staging-with-build-support-i686/build/build/zeitgeist/src/zeitgeist/config.log:AM_DEFAULT_V=''
/var/lib/archbuild/extra-staging-with-build-support-i686/build/build/zeitgeist/src/zeitgeist/config.log:AM_DEFAULT_VERBOSITY='0'
/var/lib/archbuild/extra-staging-with-build-support-i686/build/build/zeitgeist/src/zeitgeist/config.log:AM_V=''
/var/lib/archbuild/extra-staging-with-build-support-i686/build/build/zeitgeist/src/zeitgeist/config.log:AR='ar'
/var/lib/archbuild/extra-staging-with-build-support-i686/build/build/zeitgeist/src/zeitgeist/config.log:AUTOCONF='${SHELL} '\''/build/zeitgeist/src/zeitgeist/build-aux/missing'\'' autoconf'
/var/lib/archbuild/extra-staging-with-build-support-i686/build/build/zeitgeist/src/zeitgeist/config.log:AUTOHEADER='${SHELL} '\''/build/zeitgeist/src/zeitgeist/build-aux/missing'\'' autoheader'
/var/lib/archbuild/extra-staging-with-build-support-i686/build/build/zeitgeist/src/zeitgeist/config.log:AUTOMAKE='${SHELL} '\''/build/zeitgeist/src/zeitgeist/build-aux/missing'\'' automake-1.17'
/var/lib/archbuild/extra-staging-with-build-support-i686/build/build/zeitgeist/src/zeitgeist/config.log:AWK='gawk'
/var/lib/archbuild/extra-staging-with-build-support-i686/build/build/zeitgeist/src/zeitgeist/config.log:CC='gcc'
/var/lib/archbuild/extra-staging-with-build-support-i686/build/build/zeitgeist/src/zeitgeist/config.log:CCDEPMODE='depmode=gcc3'
/var/lib/archbuild/extra-staging-with-build-support-i686/build/build/zeitgeist/src/zeitgeist/config.log:CFLAGS='-march=i686 -mtune=generic -O2 -pipe -fno-plt -fexceptions         -Wp,-D_FORTIFY_SOURCE=3 -Wformat -Werror=format-security         -fstack-clash-protection          -fno-omit-frame-pointer -mno-omit-leaf-frame-pointer -g -ffile-prefix-map=/build/zeitgeist/src=/usr/src/debug/zeitgeist -flto=auto'
/var/lib/archbuild/extra-staging-with-build-support-i686/build/build/zeitgeist/src/zeitgeist/config.log:CPP='gcc -E'
/var/lib/archbuild/extra-staging-with-build-support-i686/build/build/zeitgeist/src/zeitgeist/config.log:CPPFLAGS=''
/var/lib/archbuild/extra-staging-with-build-support-i686/build/build/zeitgeist/src/zeitgeist/config.log:CSCOPE='cscope'
/var/lib/archbuild/extra-staging-with-build-support-i686/build/build/zeitgeist/src/zeitgeist/config.log:CTAGS='ctags'
/var/lib/archbuild/extra-staging-with-build-support-i686/build/build/zeitgeist/src/zeitgeist/config.log:CXX='g++'
/var/lib/archbuild/extra-staging-with-build-support-i686/build/build/zeitgeist/src/zeitgeist/config.log:CXXCPP='g++ -E'
/var/lib/archbuild/extra-staging-with-build-support-i686/build/build/zeitgeist/src/zeitgeist/config.log:CXXDEPMODE='depmode=gcc3'
/var/lib/archbuild/extra-staging-with-build-support-i686/build/build/zeitgeist/src/zeitgeist/config.log:CXXFLAGS='-march=i686 -mtune=generic -O2 -pipe -fno-plt -fexceptions         -Wp,-D_FORTIFY_SOURCE=3 -Wformat -Werror=format-security         -fstack-clash-protection          -fno-omit-frame-pointer -mno-omit-leaf-frame-pointer -Wp,-D_GLIBCXX_ASSERTIONS -g -ffile-prefix-map=/build/zeitgeist/src=/usr/src/debug/zeitgeist -flto=auto'
/var/lib/archbuild/extra-staging-with-build-support-i686/build/build/zeitgeist/src/zeitgeist/config.log:CYGPATH_W='echo'
/var/lib/archbuild/extra-staging-with-build-support-i686/build/build/zeitgeist/src/zeitgeist/config.log:DEE_ICU_CFLAGS=''
/var/lib/archbuild/extra-staging-with-build-support-i686/build/build/zeitgeist/src/zeitgeist/config.log:DEE_ICU_LIBS=''
/var/lib/archbuild/extra-staging-with-build-support-i686/build/build/zeitgeist/src/zeitgeist/config.log:DEFS=''
/var/lib/archbuild/extra-staging-with-build-support-i686/build/build/zeitgeist/src/zeitgeist/config.log:DEPDIR='.deps'
/var/lib/archbuild/extra-staging-with-build-support-i686/build/build/zeitgeist/src/zeitgeist/config.log:DLLTOOL='false'
/var/lib/archbuild/extra-staging-with-build-support-i686/build/build/zeitgeist/src/zeitgeist/config.log:DSYMUTIL=''
/var/lib/archbuild/extra-staging-with-build-support-i686/build/build/zeitgeist/src/zeitgeist/config.log:DUMPBIN=''
/var/lib/archbuild/extra-staging-with-build-support-i686/build/build/zeitgeist/src/zeitgeist/config.log:ECHO_C=''
/var/lib/archbuild/extra-staging-with-build-support-i686/build/build/zeitgeist/src/zeitgeist/config.log:ECHO_N='-n'
/var/lib/archbuild/extra-staging-with-build-support-i686/build/build/zeitgeist/src/zeitgeist/config.log:ECHO_T=''
/var/lib/archbuild/extra-staging-with-build-support-i686/build/build/zeitgeist/src/zeitgeist/config.log:EGREP='/usr/bin/grep -E'
/var/lib/archbuild/extra-staging-with-build-support-i686/build/build/zeitgeist/src/zeitgeist/config.log:ENABLE_DATAHUB_FALSE='#'
/var/lib/archbuild/extra-staging-with-build-support-i686/build/build/zeitgeist/src/zeitgeist/config.log:ENABLE_DATAHUB_TRUE=''
/var/lib/archbuild/extra-staging-with-build-support-i686/build/build/zeitgeist/src/zeitgeist/config.log:ENABLE_DOCS_FALSE=''
/var/lib/archbuild/extra-staging-with-build-support-i686/build/build/zeitgeist/src/zeitgeist/config.log:ENABLE_DOCS_TRUE='#'
/var/lib/archbuild/extra-staging-with-build-support-i686/build/build/zeitgeist/src/zeitgeist/config.log:ENABLE_DOWNLOADS_MONITOR_FALSE='#'
/var/lib/archbuild/extra-staging-with-build-support-i686/build/build/zeitgeist/src/zeitgeist/config.log:ENABLE_DOWNLOADS_MONITOR_TRUE=''
/var/lib/archbuild/extra-staging-with-build-support-i686/build/build/zeitgeist/src/zeitgeist/config.log:ENABLE_TELEPATHY_FALSE='#'
/var/lib/archbuild/extra-staging-with-build-support-i686/build/build/zeitgeist/src/zeitgeist/config.log:ENABLE_TELEPATHY_TRUE=''
/var/lib/archbuild/extra-staging-with-build-support-i686/build/build/zeitgeist/src/zeitgeist/config.log:ETAGS='etags'
/var/lib/archbuild/extra-staging-with-build-support-i686/build/build/zeitgeist/src/zeitgeist/config.log:EXEEXT=''
/var/lib/archbuild/extra-staging-with-build-support-i686/build/build/zeitgeist/src/zeitgeist/config.log:EXPLAIN_QUERIES_FALSE=''
/var/lib/archbuild/extra-staging-with-build-support-i686/build/build/zeitgeist/src/zeitgeist/config.log:EXPLAIN_QUERIES_TRUE='#'
/var/lib/archbuild/extra-staging-with-build-support-i686/build/build/zeitgeist/src/zeitgeist/config.log:FGREP='/usr/bin/grep -F'
/var/lib/archbuild/extra-staging-with-build-support-i686/build/build/zeitgeist/src/zeitgeist/config.log:FILECMD='file'
/var/lib/archbuild/extra-staging-with-build-support-i686/build/build/zeitgeist/src/zeitgeist/config.log:GETTEXT_MACRO_VERSION='0.22'
/var/lib/archbuild/extra-staging-with-build-support-i686/build/build/zeitgeist/src/zeitgeist/config.log:GETTEXT_PACKAGE='zeitgeist'
/var/lib/archbuild/extra-staging-with-build-support-i686/build/build/zeitgeist/src/zeitgeist/config.log:GMSGFMT='/usr/bin/msgfmt'
/var/lib/archbuild/extra-staging-with-build-support-i686/build/build/zeitgeist/src/zeitgeist/config.log:GMSGFMT_015='/usr/bin/msgfmt'
/var/lib/archbuild/extra-staging-with-build-support-i686/build/build/zeitgeist/src/zeitgeist/config.log:GREP='/usr/bin/grep'
/var/lib/archbuild/extra-staging-with-build-support-i686/build/build/zeitgeist/src/zeitgeist/config.log:GTKDOC_SCAN=''
/var/lib/archbuild/extra-staging-with-build-support-i686/build/build/zeitgeist/src/zeitgeist/config.log:HAVE_DEE_ICU_FALSE=''
/var/lib/archbuild/extra-staging-with-build-support-i686/build/build/zeitgeist/src/zeitgeist/config.log:HAVE_DEE_ICU_TRUE='#'
/var/lib/archbuild/extra-staging-with-build-support-i686/build/build/zeitgeist/src/zeitgeist/config.log:HAVE_FTS_FALSE='#'
/var/lib/archbuild/extra-staging-with-build-support-i686/build/build/zeitgeist/src/zeitgeist/config.log:HAVE_FTS_TRUE=''
/var/lib/archbuild/extra-staging-with-build-support-i686/build/build/zeitgeist/src/zeitgeist/config.log:HAVE_INTROSPECTION_FALSE='#'
/var/lib/archbuild/extra-staging-with-build-support-i686/build/build/zeitgeist/src/zeitgeist/config.log:HAVE_INTROSPECTION_TRUE=''
/var/lib/archbuild/extra-staging-with-build-support-i686/build/build/zeitgeist/src/zeitgeist/config.log:HAVE_XAPIAN='yes'
/var/lib/archbuild/extra-staging-with-build-support-i686/build/build/zeitgeist/src/zeitgeist/config.log:INSTALL_DATA='${INSTALL} -m 644'
/var/lib/archbuild/extra-staging-with-build-support-i686/build/build/zeitgeist/src/zeitgeist/config.log:INSTALL_PROGRAM='${INSTALL}'
/var/lib/archbuild/extra-staging-with-build-support-i686/build/build/zeitgeist/src/zeitgeist/config.log:INSTALL_SCRIPT='${INSTALL}'
/var/lib/archbuild/extra-staging-with-build-support-i686/build/build/zeitgeist/src/zeitgeist/config.log:INSTALL_STRIP_PROGRAM='$(install_sh) -c -s'
/var/lib/archbuild/extra-staging-with-build-support-i686/build/build/zeitgeist/src/zeitgeist/config.log:INTLLIBS=''
/var/lib/archbuild/extra-staging-with-build-support-i686/build/build/zeitgeist/src/zeitgeist/config.log:INTL_MACOSX_LIBS=''
/var/lib/archbuild/extra-staging-with-build-support-i686/build/build/zeitgeist/src/zeitgeist/config.log:INTROSPECTION_CFLAGS='-I/usr/include/gobject-introspection-1.0 -I/usr/include/glib-2.0 -I/usr/lib/glib-2.0/include -I/usr/include/sysprof-6 -pthread'
/var/lib/archbuild/extra-staging-with-build-support-i686/build/build/zeitgeist/src/zeitgeist/config.log:INTROSPECTION_COMPILER='/usr/bin/g-ir-compiler'
/var/lib/archbuild/extra-staging-with-build-support-i686/build/build/zeitgeist/src/zeitgeist/config.log:INTROSPECTION_GENERATE='/usr/bin/g-ir-generate'
/var/lib/archbuild/extra-staging-with-build-support-i686/build/build/zeitgeist/src/zeitgeist/config.log:INTROSPECTION_GIRDIR='/usr/share/gir-1.0'
/var/lib/archbuild/extra-staging-with-build-support-i686/build/build/zeitgeist/src/zeitgeist/config.log:INTROSPECTION_LIBS='-lgirepository-1.0 -lgobject-2.0 -lglib-2.0'
/var/lib/archbuild/extra-staging-with-build-support-i686/build/build/zeitgeist/src/zeitgeist/config.log:INTROSPECTION_MAKEFILE='/usr/share/gobject-introspection-1.0/Makefile.introspection'
/var/lib/archbuild/extra-staging-with-build-support-i686/build/build/zeitgeist/src/zeitgeist/config.log:INTROSPECTION_SCANNER='/usr/bin/g-ir-scanner'
/var/lib/archbuild/extra-staging-with-build-support-i686/build/build/zeitgeist/src/zeitgeist/config.log:INTROSPECTION_TYPELIBDIR='/usr/lib/girepository-1.0'
/var/lib/archbuild/extra-staging-with-build-support-i686/build/build/zeitgeist/src/zeitgeist/config.log:LD='/usr/bin/ld'
/var/lib/archbuild/extra-staging-with-build-support-i686/build/build/zeitgeist/src/zeitgeist/config.log:LDFLAGS='-Wl,-O1 -Wl,--sort-common -Wl,--as-needed -Wl,-z,relro -Wl,-z,now          -Wl,-z,pack-relative-relocs -flto=auto'
/var/lib/archbuild/extra-staging-with-build-support-i686/build/build/zeitgeist/src/zeitgeist/config.log:LIBICONV='-liconv'
/var/lib/archbuild/extra-staging-with-build-support-i686/build/build/zeitgeist/src/zeitgeist/config.log:LIBINTL=''
/var/lib/archbuild/extra-staging-with-build-support-i686/build/build/zeitgeist/src/zeitgeist/config.log:LIBOBJS=''
/var/lib/archbuild/extra-staging-with-build-support-i686/build/build/zeitgeist/src/zeitgeist/config.log:LIBS=''
/var/lib/archbuild/extra-staging-with-build-support-i686/build/build/zeitgeist/src/zeitgeist/config.log:LIBTOOL='$(SHELL) $(top_builddir)/libtool'
/var/lib/archbuild/extra-staging-with-build-support-i686/build/build/zeitgeist/src/zeitgeist/config.log:LIBZEITGEIST_LT_VERSION='0:0:'
/var/lib/archbuild/extra-staging-with-build-support-i686/build/build/zeitgeist/src/zeitgeist/config.log:LIPO=''
/var/lib/archbuild/extra-staging-with-build-support-i686/build/build/zeitgeist/src/zeitgeist/config.log:LN_S='ln -s'
/var/lib/archbuild/extra-staging-with-build-support-i686/build/build/zeitgeist/src/zeitgeist/config.log:LTLIBICONV='-liconv'
/var/lib/archbuild/extra-staging-with-build-support-i686/build/build/zeitgeist/src/zeitgeist/config.log:LTLIBINTL=''
/var/lib/archbuild/extra-staging-with-build-support-i686/build/build/zeitgeist/src/zeitgeist/config.log:LTLIBOBJS=''
/var/lib/archbuild/extra-staging-with-build-support-i686/build/build/zeitgeist/src/zeitgeist/config.log:LT_SYS_LIBRARY_PATH=''
/var/lib/archbuild/extra-staging-with-build-support-i686/build/build/zeitgeist/src/zeitgeist/config.log:MAINT=''
/var/lib/archbuild/extra-staging-with-build-support-i686/build/build/zeitgeist/src/zeitgeist/config.log:MAINTAINER_MODE_FALSE='#'
/var/lib/archbuild/extra-staging-with-build-support-i686/build/build/zeitgeist/src/zeitgeist/config.log:MAINTAINER_MODE_TRUE=''
/var/lib/archbuild/extra-staging-with-build-support-i686/build/build/zeitgeist/src/zeitgeist/config.log:MAKEINFO='${SHELL} '\''/build/zeitgeist/src/zeitgeist/build-aux/missing'\'' makeinfo'
/var/lib/archbuild/extra-staging-with-build-support-i686/build/build/zeitgeist/src/zeitgeist/config.log:MANIFEST_TOOL=':'
/var/lib/archbuild/extra-staging-with-build-support-i686/build/build/zeitgeist/src/zeitgeist/config.log:MKDIR_P='/usr/bin/mkdir -p'
/var/lib/archbuild/extra-staging-with-build-support-i686/build/build/zeitgeist/src/zeitgeist/config.log:MSGFMT='/usr/bin/msgfmt'
/var/lib/archbuild/extra-staging-with-build-support-i686/build/build/zeitgeist/src/zeitgeist/config.log:MSGMERGE='/usr/bin/msgmerge'
/var/lib/archbuild/extra-staging-with-build-support-i686/build/build/zeitgeist/src/zeitgeist/config.log:MSGMERGE_FOR_MSGFMT_OPTION='--for-msgfmt'
/var/lib/archbuild/extra-staging-with-build-support-i686/build/build/zeitgeist/src/zeitgeist/config.log:NM='/usr/bin/nm -B'
/var/lib/archbuild/extra-staging-with-build-support-i686/build/build/zeitgeist/src/zeitgeist/config.log:NMEDIT=''
/var/lib/archbuild/extra-staging-with-build-support-i686/build/build/zeitgeist/src/zeitgeist/config.log:OBJDUMP='objdump'
/var/lib/archbuild/extra-staging-with-build-support-i686/build/build/zeitgeist/src/zeitgeist/config.log:OBJEXT='o'
/var/lib/archbuild/extra-staging-with-build-support-i686/build/build/zeitgeist/src/zeitgeist/config.log:OTOOL64=''
/var/lib/archbuild/extra-staging-with-build-support-i686/build/build/zeitgeist/src/zeitgeist/config.log:OTOOL=''
/var/lib/archbuild/extra-staging-with-build-support-i686/build/build/zeitgeist/src/zeitgeist/config.log:PACKAGE='zeitgeist'
/var/lib/archbuild/extra-staging-with-build-support-i686/build/build/zeitgeist/src/zeitgeist/config.log:PACKAGE_BUGREPORT='https://gitlab.freedesktop.org/zeitgeist/zeitgeist/issues'
/var/lib/archbuild/extra-staging-with-build-support-i686/build/build/zeitgeist/src/zeitgeist/config.log:PACKAGE_NAME='zeitgeist'
/var/lib/archbuild/extra-staging-with-build-support-i686/build/build/zeitgeist/src/zeitgeist/config.log:PACKAGE_STRING='zeitgeist 1.0.4'
/var/lib/archbuild/extra-staging-with-build-support-i686/build/build/zeitgeist/src/zeitgeist/config.log:PACKAGE_TARNAME='zeitgeist'
/var/lib/archbuild/extra-staging-with-build-support-i686/build/build/zeitgeist/src/zeitgeist/config.log:PACKAGE_URL='https://launchpad.net/zeitgeist/'
/var/lib/archbuild/extra-staging-with-build-support-i686/build/build/zeitgeist/src/zeitgeist/config.log:PACKAGE_VERSION='1.0.4'
/var/lib/archbuild/extra-staging-with-build-support-i686/build/build/zeitgeist/src/zeitgeist/config.log:PATH_SEPARATOR=':'
/var/lib/archbuild/extra-staging-with-build-support-i686/build/build/zeitgeist/src/zeitgeist/config.log:PKG_CONFIG='/usr/bin/pkg-config'
/var/lib/archbuild/extra-staging-with-build-support-i686/build/build/zeitgeist/src/zeitgeist/config.log:PKG_CONFIG_LIBDIR=''
/var/lib/archbuild/extra-staging-with-build-support-i686/build/build/zeitgeist/src/zeitgeist/config.log:PKG_CONFIG_PATH=''
/var/lib/archbuild/extra-staging-with-build-support-i686/build/build/zeitgeist/src/zeitgeist/config.log:POSUB='po'
/var/lib/archbuild/extra-staging-with-build-support-i686/build/build/zeitgeist/src/zeitgeist/config.log:PYTHON='/usr/bin/python'
/var/lib/archbuild/extra-staging-with-build-support-i686/build/build/zeitgeist/src/zeitgeist/config.log:PYTHON_EXEC_PREFIX='${exec_prefix}'
/var/lib/archbuild/extra-staging-with-build-support-i686/build/build/zeitgeist/src/zeitgeist/config.log:PYTHON_PLATFORM='linux'
/var/lib/archbuild/extra-staging-with-build-support-i686/build/build/zeitgeist/src/zeitgeist/config.log:PYTHON_PREFIX='${prefix}'
/var/lib/archbuild/extra-staging-with-build-support-i686/build/build/zeitgeist/src/zeitgeist/config.log:PYTHON_VERSION='3.13'
/var/lib/archbuild/extra-staging-with-build-support-i686/build/build/zeitgeist/src/zeitgeist/config.log:RANLIB='ranlib'
/var/lib/archbuild/extra-staging-with-build-support-i686/build/build/zeitgeist/src/zeitgeist/config.log:SED='/usr/bin/sed'
/var/lib/archbuild/extra-staging-with-build-support-i686/build/build/zeitgeist/src/zeitgeist/config.log:SET_MAKE=''
/var/lib/archbuild/extra-staging-with-build-support-i686/build/build/zeitgeist/src/zeitgeist/config.log:SHELL='/bin/sh'
/var/lib/archbuild/extra-staging-with-build-support-i686/build/build/zeitgeist/src/zeitgeist/config.log:STRIP='strip'
/var/lib/archbuild/extra-staging-with-build-support-i686/build/build/zeitgeist/src/zeitgeist/config.log:TELEPATHY_GLIB_CFLAGS='-I/usr/include/telepathy-1.0 -I/usr/include/dbus-1.0 -I/usr/lib/dbus-1.0/include -I/usr/include/glib-2.0 -I/usr/lib/glib-2.0/include -I/usr/include/libmount -I/usr/include/blkid -I/usr/include/sysprof-6 -pthread'
/var/lib/archbuild/extra-staging-with-build-support-i686/build/build/zeitgeist/src/zeitgeist/config.log:TELEPATHY_GLIB_LIBS='-ltelepathy-glib'
/var/lib/archbuild/extra-staging-with-build-support-i686/build/build/zeitgeist/src/zeitgeist/config.log:USE_NLS='yes'
/var/lib/archbuild/extra-staging-with-build-support-i686/build/build/zeitgeist/src/zeitgeist/config.log:VALAC='/usr/bin/valac'
/var/lib/archbuild/extra-staging-with-build-support-i686/build/build/zeitgeist/src/zeitgeist/config.log:VALADOC=''
/var/lib/archbuild/extra-staging-with-build-support-i686/build/build/zeitgeist/src/zeitgeist/config.log:VERSION='1.0.4'
/var/lib/archbuild/extra-staging-with-build-support-i686/build/build/zeitgeist/src/zeitgeist/config.log:XAPIAN_CXXFLAGS=''
/var/lib/archbuild/extra-staging-with-build-support-i686/build/build/zeitgeist/src/zeitgeist/config.log:XAPIAN_LIBS='-lxapian'
/var/lib/archbuild/extra-staging-with-build-support-i686/build/build/zeitgeist/src/zeitgeist/config.log:XGETTEXT='/usr/bin/xgettext'
/var/lib/archbuild/extra-staging-with-build-support-i686/build/build/zeitgeist/src/zeitgeist/config.log:XGETTEXT_015='/usr/bin/xgettext'
/var/lib/archbuild/extra-staging-with-build-support-i686/build/build/zeitgeist/src/zeitgeist/config.log:XGETTEXT_EXTRA_OPTIONS=''
/var/lib/archbuild/extra-staging-with-build-support-i686/build/build/zeitgeist/src/zeitgeist/config.log:ZEITGEIST_CFLAGS='-I/usr/include/gio-unix-2.0 -I/usr/include/glib-2.0 -I/usr/lib/glib-2.0/include -I/usr/include/libmount -I/usr/include/blkid -I/usr/include/sysprof-6 -pthread'
/var/lib/archbuild/extra-staging-with-build-support-i686/build/build/zeitgeist/src/zeitgeist/config.log:ZEITGEIST_DATAHUB_CFLAGS='-I/usr/include/gtk-3.0 -I/usr/include/pango-1.0 -I/usr/include/cloudproviders -I/usr/include/cairo -I/usr/include/gdk-pixbuf-2.0 -I/usr/include/at-spi2-atk/2.0 -I/usr/include/at-spi-2.0 -I/usr/include/atk-1.0 -I/usr/include/fribidi -I/usr/include/pixman-1 -I/usr/include/harfbuzz -I/usr/include/freetype2 -I/usr/include/libpng16 -I/usr/include/gio-unix-2.0 -I/usr/include/json-glib-1.0 -I/usr/include/telepathy-1.0 -I/usr/include/dbus-1.0 -I/usr/lib/dbus-1.0/include -I/usr/include/glib-2.0 -I/usr/lib/glib-2.0/include -I/usr/include/libmount -I/usr/include/blkid -I/usr/include/sysprof-6 -pthread'
/var/lib/archbuild/extra-staging-with-build-support-i686/build/build/zeitgeist/src/zeitgeist/config.log:ZEITGEIST_DATAHUB_LIBS='-lgtk-3 -lgdk-3 -lz -lpangocairo-1.0 -lpango-1.0 -lharfbuzz -latk-1.0 -lcairo-gobject -lcairo -lgdk_pixbuf-2.0 -ljson-glib-1.0 -lgio-2.0 -lgobject-2.0 -lglib-2.0 -ltelepathy-glib'
/var/lib/archbuild/extra-staging-with-build-support-i686/build/build/zeitgeist/src/zeitgeist/config.log:ZEITGEIST_LIBS='-Wl,--export-dynamic -lgmodule-2.0 -pthread -lgio-2.0 -lgobject-2.0 -lglib-2.0 -lsqlite3'
/var/lib/archbuild/extra-staging-with-build-support-i686/build/build/zeitgeist/src/zeitgeist/config.log:_GI_EXP_DATADIR='/usr/share'
/var/lib/archbuild/extra-staging-with-build-support-i686/build/build/zeitgeist/src/zeitgeist/config.log:_GI_EXP_LIBDIR='/usr/lib'
/var/lib/archbuild/extra-staging-with-build-support-i686/build/build/zeitgeist/src/zeitgeist/config.log:ac_ct_AR='ar'
/var/lib/archbuild/extra-staging-with-build-support-i686/build/build/zeitgeist/src/zeitgeist/config.log:ac_ct_CC='gcc'
/var/lib/archbuild/extra-staging-with-build-support-i686/build/build/zeitgeist/src/zeitgeist/config.log:ac_ct_CXX='g++'
/var/lib/archbuild/extra-staging-with-build-support-i686/build/build/zeitgeist/src/zeitgeist/config.log:ac_ct_DUMPBIN=''
/var/lib/archbuild/extra-staging-with-build-support-i686/build/build/zeitgeist/src/zeitgeist/config.log:am__EXEEXT_FALSE=''
/var/lib/archbuild/extra-staging-with-build-support-i686/build/build/zeitgeist/src/zeitgeist/config.log:am__EXEEXT_TRUE=''
/var/lib/archbuild/extra-staging-with-build-support-i686/build/build/zeitgeist/src/zeitgeist/config.log:am__fastdepCC_FALSE='#'
/var/lib/archbuild/extra-staging-with-build-support-i686/build/build/zeitgeist/src/zeitgeist/config.log:am__fastdepCC_TRUE=''
/var/lib/archbuild/extra-staging-with-build-support-i686/build/build/zeitgeist/src/zeitgeist/config.log:am__fastdepCXX_FALSE='#'
/var/lib/archbuild/extra-staging-with-build-support-i686/build/build/zeitgeist/src/zeitgeist/config.log:am__fastdepCXX_TRUE=''
/var/lib/archbuild/extra-staging-with-build-support-i686/build/build/zeitgeist/src/zeitgeist/config.log:am__include='include'
/var/lib/archbuild/extra-staging-with-build-support-i686/build/build/zeitgeist/src/zeitgeist/config.log:am__isrc=''
/var/lib/archbuild/extra-staging-with-build-support-i686/build/build/zeitgeist/src/zeitgeist/config.log:am__leading_dot='.'
/var/lib/archbuild/extra-staging-with-build-support-i686/build/build/zeitgeist/src/zeitgeist/config.log:am__nodep='_no'
/var/lib/archbuild/extra-staging-with-build-support-i686/build/build/zeitgeist/src/zeitgeist/config.log:am__quote=''
/var/lib/archbuild/extra-staging-with-build-support-i686/build/build/zeitgeist/src/zeitgeist/config.log:am__rm_f_notfound=''
/var/lib/archbuild/extra-staging-with-build-support-i686/build/build/zeitgeist/src/zeitgeist/config.log:am__tar='tar --format=ustar -chf - "$$tardir"'
/var/lib/archbuild/extra-staging-with-build-support-i686/build/build/zeitgeist/src/zeitgeist/config.log:am__untar='tar -xf -'
/var/lib/archbuild/extra-staging-with-build-support-i686/build/build/zeitgeist/src/zeitgeist/config.log:am__xargs_n='xargs -n'
/var/lib/archbuild/extra-staging-with-build-support-i686/build/build/zeitgeist/src/zeitgeist/config.log:bindir='${exec_prefix}/bin'
/var/lib/archbuild/extra-staging-with-build-support-i686/build/build/zeitgeist/src/zeitgeist/config.log:build='i686-pc-linux-gnu'
/var/lib/archbuild/extra-staging-with-build-support-i686/build/build/zeitgeist/src/zeitgeist/config.log:build_alias=''
/var/lib/archbuild/extra-staging-with-build-support-i686/build/build/zeitgeist/src/zeitgeist/config.log:build_cpu='i686'
/var/lib/archbuild/extra-staging-with-build-support-i686/build/build/zeitgeist/src/zeitgeist/config.log:build_os='linux-gnu'
/var/lib/archbuild/extra-staging-with-build-support-i686/build/build/zeitgeist/src/zeitgeist/config.log:build_vendor='pc'
/var/lib/archbuild/extra-staging-with-build-support-i686/build/build/zeitgeist/src/zeitgeist/config.log:datadir='${datarootdir}'
/var/lib/archbuild/extra-staging-with-build-support-i686/build/build/zeitgeist/src/zeitgeist/config.log:datarootdir='${prefix}/share'
/var/lib/archbuild/extra-staging-with-build-support-i686/build/build/zeitgeist/src/zeitgeist/config.log:docdir='${datarootdir}/doc/${PACKAGE_TARNAME}'
/var/lib/archbuild/extra-staging-with-build-support-i686/build/build/zeitgeist/src/zeitgeist/config.log:dvidir='${docdir}'
/var/lib/archbuild/extra-staging-with-build-support-i686/build/build/zeitgeist/src/zeitgeist/config.log:exec_prefix='NONE'
/var/lib/archbuild/extra-staging-with-build-support-i686/build/build/zeitgeist/src/zeitgeist/config.log:host='i686-pc-linux-gnu'
/var/lib/archbuild/extra-staging-with-build-support-i686/build/build/zeitgeist/src/zeitgeist/config.log:host_alias=''
/var/lib/archbuild/extra-staging-with-build-support-i686/build/build/zeitgeist/src/zeitgeist/config.log:host_cpu='i686'
/var/lib/archbuild/extra-staging-with-build-support-i686/build/build/zeitgeist/src/zeitgeist/config.log:host_os='linux-gnu'
/var/lib/archbuild/extra-staging-with-build-support-i686/build/build/zeitgeist/src/zeitgeist/config.log:host_vendor='pc'
/var/lib/archbuild/extra-staging-with-build-support-i686/build/build/zeitgeist/src/zeitgeist/config.log:htmldir='${docdir}'
/var/lib/archbuild/extra-staging-with-build-support-i686/build/build/zeitgeist/src/zeitgeist/config.log:includedir='${prefix}/include'
/var/lib/archbuild/extra-staging-with-build-support-i686/build/build/zeitgeist/src/zeitgeist/config.log:infodir='${datarootdir}/info'
/var/lib/archbuild/extra-staging-with-build-support-i686/build/build/zeitgeist/src/zeitgeist/config.log:install_sh='${SHELL} /build/zeitgeist/src/zeitgeist/build-aux/install-sh'
/var/lib/archbuild/extra-staging-with-build-support-i686/build/build/zeitgeist/src/zeitgeist/config.log:libdir='${exec_prefix}/lib'
/var/lib/archbuild/extra-staging-with-build-support-i686/build/build/zeitgeist/src/zeitgeist/config.log:libexecdir='/usr/lib'
/var/lib/archbuild/extra-staging-with-build-support-i686/build/build/zeitgeist/src/zeitgeist/config.log:localedir='${datarootdir}/locale'
/var/lib/archbuild/extra-staging-with-build-support-i686/build/build/zeitgeist/src/zeitgeist/config.log:localedir_c='"/usr/share/locale"'
/var/lib/archbuild/extra-staging-with-build-support-i686/build/build/zeitgeist/src/zeitgeist/config.log:localedir_c_make='\"$(localedir)\"'
/var/lib/archbuild/extra-staging-with-build-support-i686/build/build/zeitgeist/src/zeitgeist/config.log:localstatedir='/var'
/var/lib/archbuild/extra-staging-with-build-support-i686/build/build/zeitgeist/src/zeitgeist/config.log:mandir='${datarootdir}/man'
/var/lib/archbuild/extra-staging-with-build-support-i686/build/build/zeitgeist/src/zeitgeist/config.log:mkdir_p='$(MKDIR_P)'
/var/lib/archbuild/extra-staging-with-build-support-i686/build/build/zeitgeist/src/zeitgeist/config.log:oldincludedir='/usr/include'
/var/lib/archbuild/extra-staging-with-build-support-i686/build/build/zeitgeist/src/zeitgeist/config.log:pdfdir='${docdir}'
/var/lib/archbuild/extra-staging-with-build-support-i686/build/build/zeitgeist/src/zeitgeist/config.log:pkgpyexecdir='${pyexecdir}/zeitgeist'
/var/lib/archbuild/extra-staging-with-build-support-i686/build/build/zeitgeist/src/zeitgeist/config.log:pkgpythondir='${pythondir}/zeitgeist'
/var/lib/archbuild/extra-staging-with-build-support-i686/build/build/zeitgeist/src/zeitgeist/config.log:prefix='/usr'
/var/lib/archbuild/extra-staging-with-build-support-i686/build/build/zeitgeist/src/zeitgeist/config.log:program_transform_name='s,x,x,'
/var/lib/archbuild/extra-staging-with-build-support-i686/build/build/zeitgeist/src/zeitgeist/config.log:psdir='${docdir}'
/var/lib/archbuild/extra-staging-with-build-support-i686/build/build/zeitgeist/src/zeitgeist/config.log:pyexecdir='${PYTHON_EXEC_PREFIX}/lib/python3.13/site-packages'
/var/lib/archbuild/extra-staging-with-build-support-i686/build/build/zeitgeist/src/zeitgeist/config.log:pythondir='${PYTHON_PREFIX}/lib/python3.13/site-packages'
/var/lib/archbuild/extra-staging-with-build-support-i686/build/build/zeitgeist/src/zeitgeist/config.log:runstatedir='${localstatedir}/run'
/var/lib/archbuild/extra-staging-with-build-support-i686/build/build/zeitgeist/src/zeitgeist/config.log:sbindir='${exec_prefix}/sbin'
/var/lib/archbuild/extra-staging-with-build-support-i686/build/build/zeitgeist/src/zeitgeist/config.log:sharedstatedir='${prefix}/com'
/var/lib/archbuild/extra-staging-with-build-support-i686/build/build/zeitgeist/src/zeitgeist/config.log:sysconfdir='/etc'
/var/lib/archbuild/extra-staging-with-build-support-i686/build/build/zeitgeist/src/zeitgeist/config.log:target_alias=''
/var/lib/archbuild/extra-staging-with-build-support-i686/build/build/zeitgeist/src/zeitgeist/config.log:
/var/lib/archbuild/extra-staging-with-build-support-i686/build/build/zeitgeist/src/zeitgeist/config.log:## ----------- ##
/var/lib/archbuild/extra-staging-with-build-support-i686/build/build/zeitgeist/src/zeitgeist/config.log:## confdefs.h. ##
/var/lib/archbuild/extra-staging-with-build-support-i686/build/build/zeitgeist/src/zeitgeist/config.log:## ----------- ##
/var/lib/archbuild/extra-staging-with-build-support-i686/build/build/zeitgeist/src/zeitgeist/config.log:
/var/lib/archbuild/extra-staging-with-build-support-i686/build/build/zeitgeist/src/zeitgeist/config.log:/* confdefs.h */
/var/lib/archbuild/extra-staging-with-build-support-i686/build/build/zeitgeist/src/zeitgeist/config.log:#define PACKAGE_NAME "zeitgeist"
/var/lib/archbuild/extra-staging-with-build-support-i686/build/build/zeitgeist/src/zeitgeist/config.log:#define PACKAGE_TARNAME "zeitgeist"
/var/lib/archbuild/extra-staging-with-build-support-i686/build/build/zeitgeist/src/zeitgeist/config.log:#define PACKAGE_VERSION "1.0.4"
/var/lib/archbuild/extra-staging-with-build-support-i686/build/build/zeitgeist/src/zeitgeist/config.log:#define PACKAGE_STRING "zeitgeist 1.0.4"
/var/lib/archbuild/extra-staging-with-build-support-i686/build/build/zeitgeist/src/zeitgeist/config.log:#define PACKAGE_BUGREPORT "https://gitlab.freedesktop.org/zeitgeist/zeitgeist/issues"
/var/lib/archbuild/extra-staging-with-build-support-i686/build/build/zeitgeist/src/zeitgeist/config.log:#define PACKAGE_URL "https://launchpad.net/zeitgeist/"
/var/lib/archbuild/extra-staging-with-build-support-i686/build/build/zeitgeist/src/zeitgeist/config.log:#define PACKAGE "zeitgeist"
/var/lib/archbuild/extra-staging-with-build-support-i686/build/build/zeitgeist/src/zeitgeist/config.log:#define VERSION "1.0.4"
/var/lib/archbuild/extra-staging-with-build-support-i686/build/build/zeitgeist/src/zeitgeist/config.log:#define HAVE_STDIO_H 1
/var/lib/archbuild/extra-staging-with-build-support-i686/build/build/zeitgeist/src/zeitgeist/config.log:#define HAVE_STDLIB_H 1
/var/lib/archbuild/extra-staging-with-build-support-i686/build/build/zeitgeist/src/zeitgeist/config.log:#define HAVE_STRING_H 1
/var/lib/archbuild/extra-staging-with-build-support-i686/build/build/zeitgeist/src/zeitgeist/config.log:#define HAVE_INTTYPES_H 1
/var/lib/archbuild/extra-staging-with-build-support-i686/build/build/zeitgeist/src/zeitgeist/config.log:#define HAVE_STDINT_H 1
/var/lib/archbuild/extra-staging-with-build-support-i686/build/build/zeitgeist/src/zeitgeist/config.log:#define HAVE_STRINGS_H 1
/var/lib/archbuild/extra-staging-with-build-support-i686/build/build/zeitgeist/src/zeitgeist/config.log:#define HAVE_SYS_STAT_H 1
/var/lib/archbuild/extra-staging-with-build-support-i686/build/build/zeitgeist/src/zeitgeist/config.log:#define HAVE_SYS_TYPES_H 1
/var/lib/archbuild/extra-staging-with-build-support-i686/build/build/zeitgeist/src/zeitgeist/config.log:#define HAVE_UNISTD_H 1
/var/lib/archbuild/extra-staging-with-build-support-i686/build/build/zeitgeist/src/zeitgeist/config.log:#define STDC_HEADERS 1
/var/lib/archbuild/extra-staging-with-build-support-i686/build/build/zeitgeist/src/zeitgeist/config.log:#define HAVE_DLFCN_H 1
/var/lib/archbuild/extra-staging-with-build-support-i686/build/build/zeitgeist/src/zeitgeist/config.log:#define LT_OBJDIR ".libs/"
/var/lib/archbuild/extra-staging-with-build-support-i686/build/build/zeitgeist/src/zeitgeist/config.log:#define GETTEXT_PACKAGE "zeitgeist"
/var/lib/archbuild/extra-staging-with-build-support-i686/build/build/zeitgeist/src/zeitgeist/config.log:#define ENABLE_NLS 1
/var/lib/archbuild/extra-staging-with-build-support-i686/build/build/zeitgeist/src/zeitgeist/config.log:#define HAVE_GETTEXT 1
/var/lib/archbuild/extra-staging-with-build-support-i686/build/build/zeitgeist/src/zeitgeist/config.log:#define HAVE_DCGETTEXT 1
/var/lib/archbuild/extra-staging-with-build-support-i686/build/build/zeitgeist/src/zeitgeist/config.log:#define ENABLE_TELEPATHY 1
/var/lib/archbuild/extra-staging-with-build-support-i686/build/build/zeitgeist/src/zeitgeist/config.log:
/var/lib/archbuild/extra-staging-with-build-support-i686/build/build/zeitgeist/src/zeitgeist/config.log:configure: exit 1
used straw: :with_build_support:haskell_without_check:
build@euronuc.lan