:: Synchronizing package databases...
 build-support-manual downloading...
 build-support downloading...
 core-staging downloading...
 extra-staging downloading...
 core-testing downloading...
 core downloading...
 extra-testing downloading...
 extra downloading...
:: Starting full system upgrade...
 there is nothing to do
==> Building in chroot for [extra-staging-with-build-support] (pentium4)...
==> Synchronizing chroot copy [/var/lib/archbuild/extra-staging-with-build-support-pentium4/root] -> [build]...done
==> Making package: xss-lock 0.3.0.r30.gac39fdc-1.0 (Fri Feb 21 13:02:00 2025)
==> Retrieving sources...
  -> Updating xss-lock git repo...
==> Validating source files with b2sums...
    xss-lock ... Passed
gpg: Warning: using insecure memory!
==> Appending keys from archlinux32.gpg...
gpg: Warning: using insecure memory!
gpg: Warning: using insecure memory!
gpg: Warning: using insecure memory!
gpg: Warning: using insecure memory!
gpg: Warning: using insecure memory!
gpg: Warning: using insecure memory!
gpg: Warning: using insecure memory!
gpg: Warning: using insecure memory!
gpg: Warning: using insecure memory!
gpg: Warning: using insecure memory!
gpg: Warning: using insecure memory!
gpg: Warning: using insecure memory!
gpg: Warning: using insecure memory!
gpg: Warning: using insecure memory!
==> Updating trust database...
gpg: Warning: using insecure memory!
gpg: next trustdb check due at 2025-06-16
==> Making package: xss-lock 0.3.0.r30.gac39fdc-1.0 (Fri Feb 21 13:02:04 2025)
==> Checking runtime dependencies...
==> Installing missing dependencies...
resolving dependencies...
looking for conflicting packages...

Packages (6) libxau-1.0.12-1.0  libxdmcp-1.1.5-1.0  xcb-proto-1.17.0-3.0  xorgproto-2024.1-2.0  libxcb-1.17.0-1.0  xcb-util-0.4.1-2.0

Total Installed Size:  6.47 MiB

:: Proceed with installation? [Y/n] 
checking keyring...
checking package integrity...
loading package files...
checking for file conflicts...
:: Processing package changes...
installing xcb-proto...
installing xorgproto...
installing libxdmcp...
installing libxau...
installing libxcb...
installing xcb-util...
:: Running post-transaction hooks...
(1/1) Arming ConditionNeedsUpdate...
==> Checking buildtime dependencies...
==> Installing missing dependencies...
resolving dependencies...
looking for conflicting packages...

Packages (11) cppdap-1.58.0-2.0  hicolor-icon-theme-0.18-1.0  jsoncpp-1.9.6-3.0  libuv-1.49.2-1.0  perl-error-0.17029-7.0  perl-mailtools-2.22-1.0  perl-timedate-2.33-7.0  rhash-1.4.4-1.0  cmake-3.31.2-1.0  git-2.47.1-1.0  python-docutils-1:0.21.2-1.1

Total Installed Size:  114.35 MiB

:: Proceed with installation? [Y/n] 
checking keyring...
checking package integrity...
loading package files...
checking for file conflicts...
:: Processing package changes...
installing cppdap...
installing hicolor-icon-theme...
installing jsoncpp...
Optional dependencies for jsoncpp
    jsoncpp-doc: documentation
installing libuv...
installing rhash...
installing cmake...
Optional dependencies for cmake
    make: for unix Makefile generator [installed]
    ninja: for ninja generator
    qt6-base: cmake-gui
installing perl-error...
installing perl-timedate...
installing perl-mailtools...
installing git...
Optional dependencies for git
    tk: gitk and git gui
    openssh: ssh transport and crypto
    perl-libwww: git svn
    perl-term-readkey: git svn and interactive.singlekey setting
    perl-io-socket-ssl: git send-email TLS support
    perl-authen-sasl: git send-email TLS support
    perl-mediawiki-api: git mediawiki support
    perl-datetime-format-iso8601: git mediawiki support
    perl-lwp-protocol-https: git mediawiki https support
    perl-cgi: gitweb (web interface) support
    python: git svn & git p4 [installed]
    subversion: git svn
    org.freedesktop.secrets: keyring credential helper
    libsecret: libsecret credential helper [installed]
installing python-docutils...
Optional dependencies for python-docutils
    python-myst-parser: to parse input in "Markdown" (CommonMark) format
    python-pillow: for some image manipulation operations
    python-pygments: for syntax highlighting of code directives and roles
:: Running post-transaction hooks...
(1/4) Creating system user accounts...
Creating group 'git' with GID 972.
Creating user 'git' (git daemon user) with UID 972 and GID 972.
(2/4) Reloading system manager configuration...
  Skipped: Current root is not booted.
(3/4) Arming ConditionNeedsUpdate...
(4/4) Warn about old perl modules
==> Retrieving sources...
==> WARNING: Skipping all source file integrity checks.
==> Extracting sources...
  -> Creating working copy of xss-lock git repo...
Cloning into 'xss-lock'...
done.
Switched to a new branch 'makepkg'
==> Starting build()...
CMake Warning:
  No source or binary directory provided.  Both will be assumed to be the
  same as the current working directory, but note that this warning will
  become a fatal error in future CMake releases.


CMake Deprecation Warning at CMakeLists.txt:1 (cmake_minimum_required):
  Compatibility with CMake < 3.10 will be removed from a future version of
  CMake.

  Update the VERSION argument <min> value.  Or, use the <min>...<max> syntax
  to tell CMake that the project requires at least <min> but has been updated
  to work with policies introduced by <max> or earlier.


-- The C compiler identification is GNU 14.2.1
-- Detecting C compiler ABI info
-- Detecting C compiler ABI info - done
-- Check for working C compiler: /usr/bin/cc - skipped
-- Detecting C compile features
-- Detecting C compile features - done
-- Found PkgConfig: /usr/bin/pkg-config (found version "2.3.0")
-- Checking for modules 'glib-2.0>=2.32;gio-unix-2.0'
--   Found glib-2.0, version 2.82.4
--   Found gio-unix-2.0, version 2.82.4
-- Checking for modules 'xcb;xcb-aux;xcb-event;xcb-screensaver'
--   Found xcb, version 1.17.0
--   Found xcb-aux, version 0.4.1
--   Found xcb-event, version 0.4.1
--   Found xcb-screensaver, version 1.17.0
-- Configuring done (0.4s)
-- Generating done (0.0s)
-- Build files have been written to: /build/xss-lock/src/xss-lock
[ 25%] Building C object src/CMakeFiles/xss-lock.dir/xss-lock.c.o
/build/xss-lock/src/xss-lock/src/xss-lock.c: In function ‘child_watch_cb’:
/build/xss-lock/src/xss-lock/src/xss-lock.c:302:5: warning: ‘g_spawn_check_exit_status’ is deprecated: Use 'g_spawn_check_wait_status' instead [-Wdeprecated-declarations]
  302 |     if (!g_spawn_check_exit_status(status, &error)) {
      |     ^~
In file included from /usr/include/glib-2.0/glib.h:84,
                 from /usr/include/glib-2.0/glib-unix.h:36,
                 from /build/xss-lock/src/xss-lock/src/xss-lock.c:12:
/usr/include/glib-2.0/glib/gspawn.h:315:10: note: declared here
  315 | gboolean g_spawn_check_exit_status (gint      wait_status,
      |          ^~~~~~~~~~~~~~~~~~~~~~~~~
[ 50%] Building C object src/CMakeFiles/xss-lock.dir/xcb_utils.c.o
[ 75%] Linking C executable xss-lock
[ 75%] Built target xss-lock
[100%] Generating xss-lock.1
Traceback (most recent call last):
  File "/usr/bin/rst2man", line 5, in <module>
    from docutils.core import rst2man
ModuleNotFoundError: No module named 'docutils'
make[2]: *** [doc/CMakeFiles/man.dir/build.make:73: doc/xss-lock.1] Error 1
make[1]: *** [CMakeFiles/Makefile2:183: doc/CMakeFiles/man.dir/all] Error 2
make: *** [Makefile:136: all] Error 2
==> ERROR: A failure occurred in build().
    Aborting...
==> ERROR: Build failed, check /var/lib/archbuild/extra-staging-with-build-support-pentium4/build/build
used straw: :with_build_support:haskell_without_check:
build@euronuc.lan