:: Synchronizing package databases...
 build-support-manual downloading...
 build-support downloading...
 core-staging downloading...
 extra-staging downloading...
 core-testing downloading...
 core downloading...
 extra-testing downloading...
 extra downloading...
:: Starting full system upgrade...
 there is nothing to do
==> Building in chroot for [extra-staging-with-build-support] (i686)...
==> Synchronizing chroot copy [/var/lib/archbuild/extra-staging-with-build-support-i686/root] -> [build]...done
==> Making package: opendht 1:3.2.0-2.0 (Tue Feb 18 18:44:40 2025)
==> Retrieving sources...
  -> Updating opendht git repo...
  -> Found llhttp.patch
==> Validating source files with sha256sums...
    opendht ... Passed
    llhttp.patch ... Passed
gpg: Warning: using insecure memory!
==> Appending keys from archlinux32.gpg...
gpg: Warning: using insecure memory!
gpg: Warning: using insecure memory!
gpg: Warning: using insecure memory!
gpg: Warning: using insecure memory!
gpg: Warning: using insecure memory!
gpg: Warning: using insecure memory!
gpg: Warning: using insecure memory!
gpg: Warning: using insecure memory!
gpg: Warning: using insecure memory!
gpg: Warning: using insecure memory!
gpg: Warning: using insecure memory!
gpg: Warning: using insecure memory!
gpg: Warning: using insecure memory!
gpg: Warning: using insecure memory!
==> Updating trust database...
gpg: Warning: using insecure memory!
gpg: next trustdb check due at 2025-06-16
==> Making package: opendht 1:3.2.0-2.0 (Tue Feb 18 18:44:44 2025)
==> Checking runtime dependencies...
==> Installing missing dependencies...
:: There are 2 providers available for libjsoncpp.so:
:: Repository extra-staging
   1) jsoncpp
:: Repository extra
   2) jsoncpp

Enter a number (default=1): 
resolving dependencies...
looking for conflicting packages...

Packages (4) argon2-20190702-6.204  fmt-11.1.3-1.2  jsoncpp-1.9.6-3.0  llhttp-9.2.1-2.0

Total Installed Size:  1.57 MiB

:: Proceed with installation? [Y/n] 
checking keyring...
checking package integrity...
loading package files...
checking for file conflicts...
:: Processing package changes...
installing argon2...
installing jsoncpp...
Optional dependencies for jsoncpp
    jsoncpp-doc: documentation
installing fmt...
installing llhttp...
:: Running post-transaction hooks...
(1/1) Arming ConditionNeedsUpdate...
==> Checking buildtime dependencies...
==> Installing missing dependencies...
resolving dependencies...
looking for conflicting packages...

Packages (29) boost-1.86.0-3.0  boost-libs-1.86.0-3.0  cppdap-1.58.0-2.0  expected-lite-0.8.0-1.0  hicolor-icon-theme-0.18-1.0  libuv-1.50.0-1.0  perl-error-0.17029-7.0  perl-mailtools-2.22-1.0  perl-timedate-2.33-7.0  python-autocommand-2.2.2-6.0  python-fastjsonschema-2.20.0-1.0  python-jaraco.context-5.3.0-1.0  python-jaraco.functools-4.0.2-1.0  python-jaraco.text-4.0.0-1.0  python-more-itertools-10.3.0-1.0  python-ordered-set-4.1.0-5.1  python-platformdirs-4.3.6-1.0  python-tomli-2.0.1-4.1  python-trove-classifiers-2024.10.21.16-1.0  python-validate-pyproject-0.22-1.0  rhash-1.4.4-1.0  asio-1.30.2-1.0  cmake-3.31.2-1.0  cppunit-1.15.1-4.0  cython-3.0.11-1.0  git-2.47.1-1.0  msgpack-cxx-7.0.0-1.0  python-setuptools-1:69.5.1-1.1  restinio-0.7.2-2.0

Total Installed Size:  329.06 MiB

:: Proceed with installation? [Y/n] 
checking keyring...
checking package integrity...
loading package files...
checking for file conflicts...
:: Processing package changes...
installing perl-error...
installing perl-timedate...
installing perl-mailtools...
installing git...
Optional dependencies for git
    tk: gitk and git gui
    openssh: ssh transport and crypto
    perl-libwww: git svn
    perl-term-readkey: git svn and interactive.singlekey setting
    perl-io-socket-ssl: git send-email TLS support
    perl-authen-sasl: git send-email TLS support
    perl-mediawiki-api: git mediawiki support
    perl-datetime-format-iso8601: git mediawiki support
    perl-lwp-protocol-https: git mediawiki https support
    perl-cgi: gitweb (web interface) support
    python: git svn & git p4 [installed]
    subversion: git svn
    org.freedesktop.secrets: keyring credential helper
    libsecret: libsecret credential helper [installed]
installing cppdap...
installing hicolor-icon-theme...
installing libuv...
installing rhash...
installing cmake...
Optional dependencies for cmake
    make: for unix Makefile generator [installed]
    ninja: for ninja generator
    qt6-base: cmake-gui
installing boost-libs...
Optional dependencies for boost-libs
    openmpi: for mpi support
installing boost...
Optional dependencies for boost
    python: for python bindings [installed]
installing msgpack-cxx...
installing asio...
installing expected-lite...
installing restinio...
installing cython...
installing python-more-itertools...
installing python-jaraco.functools...
installing python-jaraco.context...
installing python-autocommand...
installing python-jaraco.text...
Optional dependencies for python-jaraco.text
    python-inflect: for show-newlines script
installing python-ordered-set...
installing python-platformdirs...
installing python-tomli...
installing python-fastjsonschema...
installing python-trove-classifiers...
installing python-validate-pyproject...
installing python-setuptools...
installing cppunit...
:: Running post-transaction hooks...
(1/4) Creating system user accounts...
Creating group 'git' with GID 972.
Creating user 'git' (git daemon user) with UID 972 and GID 972.
(2/4) Reloading system manager configuration...
  Skipped: Current root is not booted.
(3/4) Arming ConditionNeedsUpdate...
(4/4) Warn about old perl modules
==> Retrieving sources...
  -> Found llhttp.patch
==> WARNING: Skipping all source file integrity checks.
==> Extracting sources...
  -> Creating working copy of opendht git repo...
Cloning into 'opendht'...
done.
Switched to a new branch 'makepkg'
==> Starting prepare()...
patching file CMakeLists.txt
==> Starting build()...
-- The C compiler identification is GNU 14.2.1
-- The CXX compiler identification is GNU 14.2.1
-- Detecting C compiler ABI info
-- Detecting C compiler ABI info - done
-- Check for working C compiler: /usr/bin/cc - skipped
-- Detecting C compile features
-- Detecting C compile features - done
-- Detecting CXX compiler ABI info
-- Detecting CXX compiler ABI info - done
-- Check for working CXX compiler: /usr/bin/c++ - skipped
-- Detecting CXX compile features
-- Detecting CXX compile features - done
-- Found PkgConfig: /usr/bin/pkg-config (found version "2.3.0")
-- Performing Test HAVE_CXX_ATOMICS_WITHOUT_LIB
-- Performing Test HAVE_CXX_ATOMICS_WITHOUT_LIB - Success
-- Performing Test HAVE_CXX_ATOMICS64_WITHOUT_LIB
-- Performing Test HAVE_CXX_ATOMICS64_WITHOUT_LIB - Success
-- Performing Test LLVM_HAS_ATOMICS
-- Performing Test LLVM_HAS_ATOMICS - Success
-- Could NOT find Doxygen (missing: DOXYGEN_EXECUTABLE) 
-- Performing Test CMAKE_HAVE_LIBC_PTHREAD
-- Performing Test CMAKE_HAVE_LIBC_PTHREAD - Success
-- Found Threads: TRUE
-- Checking for one of the modules 'gnutls'
-- Checking for one of the modules 'nettle'
-- Looking for C++ include msgpack.hpp
-- Looking for C++ include msgpack.hpp - found
-- Found Readline: /usr/lib/libreadline.so (Required is at least version "6")
-- Checking for one of the modules 'libargon2'
-- Checking for one of the modules 'jsoncpp'
-- Found ASIO /usr/include
-- Found Restinio: /usr/include
-- Found llhttp /usr/include /usr/lib/libllhttp.so
-- Checking for one of the modules 'openssl'
-- Found OpenSSL 3.4.1 /usr/include
-- Checking for one of the modules 'liburing'
Indexation enabled since it is required for Python support
Using push notification
-- Using Systemd unit installation directory requested: /usr/lib/systemd/system/
-- Checking for one of the modules 'cppunit'
-- Configuring done (2.7s)
-- Generating done (0.0s)
CMake Warning:
  Manually-specified variables were not used by the project:

    OPENDHT_TESTS


-- Build files have been written to: /build/opendht/src/build
make: Entering directory '/build/opendht/src/build'
[  2%] Building CXX object CMakeFiles/opendht.dir/src/base64.cpp.o
[  4%] Building CXX object CMakeFiles/opendht.dir/src/utils.cpp.o
[  6%] Building CXX object CMakeFiles/opendht.dir/src/crypto.cpp.o
/build/opendht/src/opendht/src/crypto.cpp: In static member function ‘static dht::crypto::Certificate dht::crypto::Certificate::generate(const dht::crypto::PrivateKey&, const std::string&, const dht::crypto::Identity&, bool, int64_t)’:
/build/opendht/src/opendht/src/crypto.cpp:1279:17: warning: suggest parentheses around assignment used as truth value [-Wparentheses]
 1279 |         if (err = gnutls_x509_crt_privkey_sign(cert, ca.second->cert, ca.first->key, pk.getPreferredDigest(), 0)) {
      |             ~~~~^~~~~~~~~~~~~~~~~~~~~~~~~~~~~~~~~~~~~~~~~~~~~~~~~~~~~~~~~~~~~~~~~~~~~~~~~~~~~~~~~~~~~~~~~~~~~~~~
/build/opendht/src/opendht/src/crypto.cpp:1284:17: warning: suggest parentheses around assignment used as truth value [-Wparentheses]
 1284 |         if (err = gnutls_x509_crt_privkey_sign(cert, cert, key.key, pk.getPreferredDigest(), 0)) {
      |             ~~~~^~~~~~~~~~~~~~~~~~~~~~~~~~~~~~~~~~~~~~~~~~~~~~~~~~~~~~~~~~~~~~~~~~~~~~~~~~~~~~~
[  9%] Building CXX object CMakeFiles/opendht.dir/src/default_types.cpp.o
[ 11%] Building CXX object CMakeFiles/opendht.dir/src/node.cpp.o
[ 13%] Building CXX object CMakeFiles/opendht.dir/src/value.cpp.o
[ 15%] Building CXX object CMakeFiles/opendht.dir/src/dht.cpp.o
[ 18%] Building CXX object CMakeFiles/opendht.dir/src/op_cache.cpp.o
[ 20%] Building CXX object CMakeFiles/opendht.dir/src/callbacks.cpp.o
[ 22%] Building CXX object CMakeFiles/opendht.dir/src/routing_table.cpp.o
[ 25%] Building CXX object CMakeFiles/opendht.dir/src/node_cache.cpp.o
[ 27%] Building CXX object CMakeFiles/opendht.dir/src/network_engine.cpp.o
[ 29%] Building CXX object CMakeFiles/opendht.dir/src/securedht.cpp.o
[ 31%] Building CXX object CMakeFiles/opendht.dir/src/dhtrunner.cpp.o
[ 34%] Building CXX object CMakeFiles/opendht.dir/src/log.cpp.o
[ 36%] Building CXX object CMakeFiles/opendht.dir/src/network_utils.cpp.o
[ 38%] Building CXX object CMakeFiles/opendht.dir/src/thread_pool.cpp.o
[ 40%] Building CXX object CMakeFiles/opendht.dir/src/peer_discovery.cpp.o
[ 43%] Building CXX object CMakeFiles/opendht.dir/src/indexation/pht.cpp.o
[ 45%] Building CXX object CMakeFiles/opendht.dir/src/dht_proxy_server.cpp.o
[ 47%] Building CXX object CMakeFiles/opendht.dir/src/dht_proxy_client.cpp.o
[ 50%] Building CXX object CMakeFiles/opendht.dir/src/http.cpp.o
[ 52%] Building CXX object CMakeFiles/opendht.dir/src/compat/os_cert.cpp.o
[ 54%] Linking CXX shared library libopendht.so
[ 54%] Built target opendht
[ 56%] Building CXX object CMakeFiles/opendht_unit_tests.dir/tests/tests_runner.cpp.o
[ 59%] Building CXX object CMakeFiles/opendht_unit_tests.dir/tests/infohashtester.cpp.o
[ 61%] Building CXX object CMakeFiles/opendht_unit_tests.dir/tests/valuetester.cpp.o
[ 63%] Building CXX object CMakeFiles/opendht_unit_tests.dir/tests/cryptotester.cpp.o
[ 65%] Building CXX object CMakeFiles/opendht_unit_tests.dir/tests/dhtrunnertester.cpp.o
[ 68%] Building CXX object CMakeFiles/opendht_unit_tests.dir/tests/threadpooltester.cpp.o
[ 70%] Building CXX object CMakeFiles/opendht_unit_tests.dir/tests/httptester.cpp.o
[ 72%] Building CXX object CMakeFiles/opendht_unit_tests.dir/tests/dhtproxytester.cpp.o
[ 75%] Building CXX object CMakeFiles/opendht_unit_tests.dir/tests/peerdiscoverytester.cpp.o
[ 77%] Linking CXX executable opendht_unit_tests
[ 77%] Built target opendht_unit_tests
[ 79%] Building CXX object tools/CMakeFiles/dhtnode.dir/dhtnode.cpp.o
[ 81%] Linking CXX executable dhtnode
[ 81%] Built target dhtnode
[ 84%] Building CXX object tools/CMakeFiles/dhtscanner.dir/dhtscanner.cpp.o
[ 86%] Linking CXX executable dhtscanner
[ 86%] Built target dhtscanner
[ 88%] Building CXX object tools/CMakeFiles/dhtchat.dir/dhtchat.cpp.o
[ 90%] Linking CXX executable dhtchat
[ 90%] Built target dhtchat
[ 93%] Building CXX object tools/CMakeFiles/perftest.dir/perftest.cpp.o
[ 95%] Linking CXX executable perftest
[ 95%] Built target perftest
[ 97%] Building CXX object tools/CMakeFiles/durl.dir/durl.cpp.o
[100%] Linking CXX executable durl
[100%] Built target durl
Traceback (most recent call last):
  File "/build/opendht/src/build/python/setup.py", line 24, in <module>
    from setuptools import setup, Extension
ModuleNotFoundError: No module named 'setuptools'
make[2]: *** [python/CMakeFiles/python.dir/build.make:73: python/CMakeFiles/python] Error 1
make[1]: *** [CMakeFiles/Makefile2:1284: python/CMakeFiles/python.dir/all] Error 2
make: *** [Makefile:146: all] Error 2
make: Leaving directory '/build/opendht/src/build'
==> ERROR: A failure occurred in build().
    Aborting...
==> ERROR: Build failed, check /var/lib/archbuild/extra-staging-with-build-support-i686/build/build
used straw: :with_build_support:haskell_without_check:
build@euronuc.lan