:: Synchronizing package databases...
 core-staging downloading...
 core-testing downloading...
 core downloading...
 extra-staging downloading...
 extra-testing downloading...
 extra downloading...
:: Starting full system upgrade...
 there is nothing to do
==> Building in chroot for [extra-staging] (i686)...
==> Synchronizing chroot copy [/var/lib/archbuild/extra-staging-i686/root] -> [build]...done
==> Making package: cargo-shuttle 0.53.0-1.0 (Sat Mar 29 13:33:21 2025)
==> Retrieving sources...
  -> Updating cargo-shuttle git repo...
  -> Updating cargo-shuttle-examples git repo...
==> Validating source files with sha512sums...
    cargo-shuttle ... Passed
    cargo-shuttle-examples ... Skipped
gpg: Warning: using insecure memory!
==> Appending keys from archlinux32.gpg...
gpg: Warning: using insecure memory!
gpg: Warning: using insecure memory!
gpg: Warning: using insecure memory!
gpg: Warning: using insecure memory!
gpg: Warning: using insecure memory!
gpg: Warning: using insecure memory!
gpg: Warning: using insecure memory!
gpg: Warning: using insecure memory!
gpg: Warning: using insecure memory!
gpg: Warning: using insecure memory!
gpg: Warning: using insecure memory!
gpg: Warning: using insecure memory!
gpg: Warning: using insecure memory!
gpg: Warning: using insecure memory!
==> Updating trust database...
gpg: Warning: using insecure memory!
gpg: next trustdb check due at 2025-06-16
==> Making package: cargo-shuttle 0.53.0-1.0 (Sat Mar 29 13:33:25 2025)
==> Checking runtime dependencies...
==> Installing missing dependencies...
:: There are 2 providers available for cargo:
:: Repository extra
   1) rust  2) rustup

Enter a number (default=1): 
resolving dependencies...
looking for conflicting packages...

Package (3)              New Version       Net Change

core-staging/libedit     20250104_3.1-1.1    0.25 MiB
extra-staging/llvm-libs  18.1.8-4.1        132.34 MiB
extra/rust               1:1.81.0-1.0      343.06 MiB

Total Installed Size:  475.65 MiB

:: Proceed with installation? [Y/n] 
checking keyring...
checking package integrity...
loading package files...
checking for file conflicts...
:: Processing package changes...
installing libedit...
installing llvm-libs...
installing rust...
Optional dependencies for rust
    gdb: rust-gdb script
    lldb: rust-lldb script
:: Running post-transaction hooks...
(1/1) Arming ConditionNeedsUpdate...
==> Checking buildtime dependencies...
==> Installing missing dependencies...
resolving dependencies...
looking for conflicting packages...

Package (4)                   New Version  Net Change

extra-staging/perl-error      0.17029-7.0    0.04 MiB
extra-staging/perl-mailtools  2.22-1.0       0.10 MiB
extra-staging/perl-timedate   2.33-7.0       0.08 MiB
extra/git                     2.47.1-1.0    28.23 MiB

Total Installed Size:  28.45 MiB

:: Proceed with installation? [Y/n] 
checking keyring...
checking package integrity...
loading package files...
checking for file conflicts...
:: Processing package changes...
installing perl-error...
installing perl-timedate...
installing perl-mailtools...
installing git...
Optional dependencies for git
    tk: gitk and git gui
    openssh: ssh transport and crypto
    perl-libwww: git svn
    perl-term-readkey: git svn and interactive.singlekey setting
    perl-io-socket-ssl: git send-email TLS support
    perl-authen-sasl: git send-email TLS support
    perl-mediawiki-api: git mediawiki support
    perl-datetime-format-iso8601: git mediawiki support
    perl-lwp-protocol-https: git mediawiki https support
    perl-cgi: gitweb (web interface) support
    python: git svn & git p4 [installed]
    subversion: git svn
    org.freedesktop.secrets: keyring credential helper
    libsecret: libsecret credential helper [installed]
:: Running post-transaction hooks...
(1/4) Creating system user accounts...
Creating group 'git' with GID 972.
Creating user 'git' (git daemon user) with UID 972 and GID 972.
(2/4) Reloading system manager configuration...
  Skipped: Current root is not booted.
(3/4) Arming ConditionNeedsUpdate...
(4/4) Warn about old perl modules
==> Retrieving sources...
==> WARNING: Skipping all source file integrity checks.
==> Extracting sources...
  -> Creating working copy of cargo-shuttle git repo...
Cloning into 'cargo-shuttle'...
done.
Switched to a new branch 'makepkg'
  -> Creating working copy of cargo-shuttle-examples git repo...
Cloning into 'cargo-shuttle-examples'...
done.
==> Starting prepare()...
Submodule 'examples' (/startdir/shuttle-examples.git) registered for path 'examples'
Cloning into '/build/cargo-shuttle/src/cargo-shuttle/examples'...
done.
Submodule path 'examples': checked out 'b20c9ee3245e65a59f053b5994334bf0d9d236e3'
    Updating crates.io index
 Downloading crates ...
  Downloaded equivalent v1.0.2
  Downloaded headers-core v0.3.0
  Downloaded httpdate v1.0.3
  Downloaded typeshare-annotation v1.0.4
  Downloaded typeshare v1.0.4
  Downloaded want v0.3.1
  Downloaded tower-service v0.3.3
  Downloaded sync_wrapper v1.0.2
  Downloaded strum v0.27.1
  Downloaded try-lock v0.2.5
  Downloaded comma v1.0.0
  Downloaded autocfg v1.4.0
  Downloaded zeroize_derive v1.4.2
  Downloaded zeroize v1.8.1
  Downloaded strfmt v0.2.4
  Downloaded number_prefix v0.4.0
  Downloaded portpicker v0.1.1
  Downloaded tower-layer v0.3.3
  Downloaded io-close v0.3.7
  Downloaded errno v0.3.10
  Downloaded itoa v1.0.15
  Downloaded futures-task v0.3.31
  Downloaded glob v0.3.2
  Downloaded futures-io v0.3.31
  Downloaded proc-macro-crate v3.3.0
warning: spurious network error (3 tries remaining): failed to get successful HTTP response from `https://static.crates.io/crates/hashbrown/0.14.5/download` (146.75.118.137), got 502
body:
I/O error
  Downloaded futures-timer v3.0.3
warning: spurious network error (3 tries remaining): failed to get successful HTTP response from `https://static.crates.io/crates/ignore/0.4.23/download` (146.75.118.137), got 502
body:
I/O error
warning: spurious network error (3 tries remaining): failed to get successful HTTP response from `https://static.crates.io/crates/tracing-subscriber/0.3.19/download` (146.75.118.137), got 502
body:
I/O error
  Downloaded cfg-if v1.0.0
  Downloaded time-core v0.1.3
  Downloaded http-body v1.0.1
  Downloaded fnv v1.0.7
  Downloaded futures-macro v0.3.31
  Downloaded heck v0.5.0
  Downloaded futures-core v0.3.31
  Downloaded http-body-util v0.1.3
  Downloaded slab v0.4.9
  Downloaded signal-hook-registry v1.4.2
  Downloaded futures-sink v0.3.31
  Downloaded either v1.15.0
  Downloaded signal-hook-mio v0.2.4
  Downloaded atomic-waker v1.1.2
  Downloaded pin-utils v0.1.0
  Downloaded percent-encoding v2.3.1
  Downloaded opentelemetry-http v0.27.0
  Downloaded serde_spanned v0.6.8
  Downloaded matchers v0.1.0
  Downloaded iana-time-zone v0.1.61
  Downloaded mime v0.3.17
  Downloaded thiserror-impl v2.0.12
  Downloaded serde_path_to_error v0.1.17
  Downloaded scopeguard v1.2.0
  Downloaded thiserror v2.0.12
  Downloaded num-conv v0.1.0
  Downloaded quote v1.0.40
  Downloaded proc-macro-error-attr2 v2.0.0
  Downloaded tinyvec_macros v0.1.1
  Downloaded futures-channel v0.3.31
  Downloaded rustversion v1.0.20
  Downloaded toml_datetime v0.6.8
  Downloaded gix-hashtable v0.7.0
  Downloaded rustc_version v0.4.1
  Downloaded tokio-macros v2.5.0
  Downloaded pbkdf2 v0.12.2
  Downloaded pin-project-lite v0.2.16
  Downloaded relative-path v1.9.3
  Downloaded deranged v0.3.11
  Downloaded strum_macros v0.27.1
  Downloaded time-macros v0.2.20
  Downloaded lockfree-object-pool v0.1.6
  Downloaded adler2 v2.0.0
  Downloaded faster-hex v0.9.0
  Downloaded gix-worktree-state v0.17.0
  Downloaded async-trait v0.1.87
  Downloaded gix-worktree v0.39.0
  Downloaded gix-trace v0.1.12
  Downloaded inout v0.1.4
  Downloaded lock_api v0.4.12
  Downloaded semver v1.0.26
  Downloaded gix-path v0.10.14
  Downloaded parking_lot_core v0.9.10
  Downloaded same-file v1.0.6
  Downloaded matchit v0.8.4
  Downloaded sha1_smol v1.0.1
  Downloaded home v0.5.11
  Downloaded simd-adler32 v0.3.7
  Downloaded smallvec v1.14.0
  Downloaded crc v3.2.1
  Downloaded byteorder v1.5.0
  Downloaded unicode-ident v1.0.18
  Downloaded option-ext v0.2.0
  Downloaded difflib v0.4.0
  Downloaded indoc v2.0.6
  Downloaded anstyle-query v1.1.2
  Downloaded zerofrom v0.1.6
  Downloaded generic-array v0.14.7
  Downloaded rand_core v0.6.4
  Downloaded prost-derive v0.13.5
  Downloaded gix-validate v0.9.3
  Downloaded cipher v0.4.4
  Downloaded deflate64 v0.1.9
  Downloaded serde_urlencoded v0.7.1
  Downloaded data-encoding v2.8.0
  Downloaded crc-catalog v2.4.0
  Downloaded hyper-rustls v0.27.5
  Downloaded once_cell v1.21.0
  Downloaded prost v0.13.5
  Downloaded opentelemetry-otlp v0.27.0
  Downloaded ryu v1.0.20
  Downloaded num-traits v0.2.19
  Downloaded tracing-attributes v0.1.28
  Downloaded signal-hook v0.3.17
  Downloaded pkg-config v0.3.32
  Downloaded bitflags v2.9.0
  Downloaded axum-core v0.5.0
  Downloaded parking_lot v0.12.3
  Downloaded icu_provider_macros v1.5.0
  Downloaded gix-hash v0.16.0
  Downloaded gix-quote v0.4.15
  Downloaded filetime v0.2.25
  Downloaded tracing-core v0.1.33
  Downloaded gix-date v0.9.3
  Downloaded proc-macro2 v1.0.94
  Downloaded powerfmt v0.2.0
  Downloaded fastrand v2.3.0
  Downloaded gix-submodule v0.17.0
  Downloaded gix-packetline v0.18.3
  Downloaded gix-revwalk v0.18.0
  Downloaded clru v0.6.2
  Downloaded shell-words v1.1.0
  Downloaded openssl-probe v0.1.6
  Downloaded clap_mangen v0.2.26
  Downloaded thread_local v1.1.8
  Downloaded log v0.4.26
  Downloaded predicates-tree v1.0.12
  Downloaded stable_deref_trait v1.2.0
  Downloaded zstd-safe v7.2.3
  Downloaded utf16_iter v1.0.5
  Downloaded litemap v0.7.5
  Downloaded proc-macro-error2 v2.0.1
  Downloaded yoke-derive v0.7.5
  Downloaded rand_chacha v0.3.1
  Downloaded quinn-udp v0.5.10
  Downloaded rand_core v0.9.3
  Downloaded rstest v0.24.0
  Downloaded serde_derive v1.0.219
  Downloaded rstest_macros v0.24.0
  Downloaded crc32fast v1.4.2
  Downloaded gix-utils v0.1.14
  Downloaded pin-project-internal v1.1.10
  Downloaded anyhow v1.0.97
  Downloaded crossbeam-deque v0.8.6
  Downloaded bzip2 v0.5.2
  Downloaded socket2 v0.5.8
  Downloaded gix-commitgraph v0.26.0
  Downloaded serde v1.0.219
  Downloaded utoipa v5.3.1
  Downloaded gix-url v0.29.0
  Downloaded tempfile v3.18.0
  Downloaded gix-shallow v0.2.0
  Downloaded digest v0.10.7
  Downloaded gix-features v0.40.0
  Downloaded zerofrom-derive v0.1.6
  Downloaded rexpect v0.6.0
  Downloaded globset v0.4.16
  Downloaded utf-8 v0.7.6
  Downloaded cfg_aliases v0.2.1
  Downloaded gix-command v0.4.1
  Downloaded overload v0.1.1
  Downloaded predicates-core v1.0.9
  Downloaded gix-attributes v0.24.0
  Downloaded icu_normalizer_data v1.5.0
  Downloaded bytes v1.10.1
  Downloaded lzma-rs v0.3.0
  Downloaded gix-traverse v0.44.0
  Downloaded walkdir v2.5.0
  Downloaded constant_time_eq v0.3.1
  Downloaded tracing v0.1.41
  Downloaded comfy-table v7.1.4
  Downloaded zstd v0.13.3
  Downloaded indexmap v2.8.0
  Downloaded cpufeatures v0.2.17
  Downloaded gix-negotiate v0.18.0
  Downloaded cargo-platform v0.1.9
  Downloaded rustls-pemfile v2.2.0
  Downloaded jobserver v0.1.32
  Downloaded doc-comment v0.3.3
  Downloaded dialoguer v0.11.0
  Downloaded termtree v0.5.1
  Downloaded thiserror v1.0.69
  Downloaded console v0.15.11
  Downloaded clap_derive v4.5.32
  Downloaded camino v1.1.9
  Downloaded crypto-common v0.1.6
  Downloaded hex v0.4.3
  Downloaded zopfli v0.8.1
  Downloaded yoke v0.7.5
  Downloaded version_check v0.9.5
  Downloaded static_assertions v1.1.0
  Downloaded gix-lock v16.0.0
  Downloaded gix-chunk v0.4.11
  Downloaded termcolor v1.4.1
  Downloaded getrandom v0.2.15
  Downloaded form_urlencoded v1.2.1
  Downloaded dunce v1.0.5
  Downloaded pin-project v1.1.10
  Downloaded icu_locid v1.5.0
  Downloaded anstyle v1.0.10
  Downloaded gix-packetline-blocking v0.18.2
  Downloaded predicates v3.1.3
  Downloaded crossbeam-epoch v0.9.18
  Downloaded wait-timeout v0.2.1
  Downloaded rustls-pki-types v1.11.0
  Downloaded ahash v0.8.11
  Downloaded hmac v0.12.1
  Downloaded http v1.3.1
  Downloaded gix-prompt v0.9.1
  Downloaded memmap2 v0.9.5
  Downloaded memchr v2.7.4
  Downloaded utf8_iter v1.0.4
  Downloaded is_terminal_polyfill v1.70.1
  Downloaded block-buffer v0.10.4
  Downloaded gix-discover v0.38.0
  Downloaded tracing-log v0.2.0
  Downloaded write16 v1.0.0
  Downloaded gix-ref v0.50.0
  Downloaded gix-config v0.43.0
  Downloaded kstring v2.0.2
  Downloaded dirs v6.0.0
  Downloaded dirs-sys v0.5.0
  Downloaded headers v0.4.0
  Downloaded futures v0.3.31
  Downloaded clap v4.5.32
  Downloaded gix-glob v0.18.0
  Downloaded target-triple v0.1.4
  Downloaded getrandom v0.3.1
  Downloaded tokio-tungstenite v0.26.2
  Downloaded utf8parse v0.2.2
  Downloaded rand_chacha v0.9.0
  Downloaded tungstenite v0.26.2
  Downloaded gix-ignore v0.13.0
  Downloaded gix-bitmap v0.2.14
  Downloaded gix-refspec v0.28.0
  Downloaded roff v0.2.2
  Downloaded gix-tempfile v16.0.0
  Downloaded httparse v1.10.1
  Downloaded icu_collections v1.5.0
  Downloaded gix-object v0.47.0
  Downloaded crossbeam-utils v0.8.21
  Downloaded mio v1.0.3
  Downloaded anstream v0.6.18
  Downloaded tokio-stream v0.1.17
  Downloaded tower v0.5.2
  Downloaded colorchoice v1.0.3
  Downloaded strsim v0.11.1
  Downloaded writeable v0.5.5
  Downloaded unicode-bom v2.0.3
  Downloaded gix-actor v0.33.2
  Downloaded idna_adapter v1.2.0
  Downloaded clap_lex v0.7.4
  Downloaded maybe-async v0.2.10
  Downloaded rustc-hash v2.1.1
  Downloaded trybuild v1.0.104
  Downloaded nu-ansi-term v0.46.0
  Downloaded untrusted v0.9.0
  Downloaded yansi v1.0.1
  Downloaded gix-sec v0.10.11
  Downloaded gix-pathspec v0.9.0
  Downloaded opentelemetry v0.27.1
  Downloaded gix-revision v0.32.0
  Downloaded rustls-native-certs v0.8.1
  Downloaded indicatif v0.17.11
  Downloaded opentelemetry-semantic-conventions v0.27.0
  Downloaded icu_normalizer v1.5.0
  Downloaded hyperlocal v0.9.1
  Downloaded hashbrown v0.15.2
  Downloaded sha1 v0.10.6
  Downloaded reqwest-middleware v0.4.1
  Downloaded thiserror-impl v1.0.69
  Downloaded tokio-rustls v0.26.2
  Downloaded serde_repr v0.1.20
  Downloaded webbrowser v1.0.4
  Downloaded miniz_oxide v0.8.5
  Downloaded clap_complete v4.5.46
  Downloaded subtle v2.6.1
  Downloaded ppv-lite86 v0.2.21
  Downloaded icu_locid_transform v1.5.0
  Downloaded displaydoc v0.2.5
  Downloaded lazy_static v1.5.0
  Downloaded futures-executor v0.3.31
  Downloaded icu_locid_transform_data v1.5.0
  Downloaded tracing-serde v0.2.0
  Downloaded rand v0.8.5
  Downloaded shlex v1.3.0
  Downloaded unicode-segmentation v1.12.0
  Downloaded toml_edit v0.22.24
  Downloaded crossterm v0.28.1
  Downloaded indexmap v1.9.3
  Downloaded hashbrown v0.12.3
  Downloaded synstructure v0.13.1
  Downloaded ignore v0.4.23
  Downloaded tinyvec v1.9.0
  Downloaded gix-transport v0.45.0
  Downloaded icu_provider v1.5.0
  Downloaded diff v0.1.13
  Downloaded zerovec v0.10.4
  Downloaded gix-credentials v0.27.0
  Downloaded zerovec-derive v0.10.3
  Downloaded gix-fs v0.13.0
  Downloaded ipnet v2.11.0
  Downloaded arc-swap v1.7.1
  Downloaded typenum v1.18.0
  Downloaded allocator-api2 v0.2.21
  Downloaded bollard-stubs v1.47.1-rc.27.3.1
  Downloaded tinystr v0.7.6
  Downloaded gix-pack v0.57.0
  Downloaded futures-util v0.3.31
  Downloaded axum v0.8.1
  Downloaded toml v0.8.20
  Downloaded gix-diff v0.50.0
  Downloaded gix-protocol v0.48.0
  Downloaded gix-config-value v0.14.11
  Downloaded icu_properties v1.5.1
  Downloaded serde_json v1.0.140
  Downloaded assert_cmd v2.0.16
  Downloaded pretty_assertions v1.4.1
  Downloaded gix-odb v0.67.0
  Downloaded winnow v0.7.3
  Downloaded base64 v0.22.1
  Downloaded aho-corasick v1.1.3
  Downloaded anstyle-parse v0.2.6
  Downloaded utoipa-gen v5.3.1
  Downloaded cargo_metadata v0.19.2
  Downloaded idna v1.0.3
  Downloaded tonic v0.12.3
  Downloaded sharded-slab v0.1.7
  Downloaded opentelemetry_sdk v0.27.1
  Downloaded base64 v0.21.7
  Downloaded gix-index v0.38.0
  Downloaded bumpalo v3.17.0
  Downloaded gix-filter v0.17.0
  Downloaded zip v2.2.3
  Downloaded cc v1.2.16
  Downloaded bollard v0.18.1
  Downloaded url v2.5.4
  Downloaded quinn v0.11.6
  Downloaded chrono v0.4.40
  Downloaded hyper-util v0.1.10
  Downloaded rand v0.9.0
  Downloaded itertools v0.14.0
  Downloaded flate2 v1.1.0
  Downloaded quinn-proto v0.11.9
  Downloaded unicode-normalization v0.1.24
  Downloaded aes v0.8.4
  Downloaded regex v1.11.1
  Downloaded unicode-width v0.2.0
  Downloaded prodash v29.0.1
  Downloaded tokio-util v0.7.13
  Downloaded hashbrown v0.14.5
  Downloaded zerocopy v0.8.23
  Downloaded git2 v0.20.0
  Downloaded tracing-subscriber v0.3.19
  Downloaded icu_properties_data v1.5.0
  Downloaded time v0.3.39
  Downloaded reqwest v0.12.14
  Downloaded webpki-roots v0.26.8
  Downloaded syn v2.0.100
  Downloaded regex-automata v0.1.10
  Downloaded hyper v1.6.0
  Downloaded vcpkg v0.2.15
  Downloaded regex-syntax v0.6.29
  Downloaded h2 v0.4.8
  Downloaded zerocopy v0.7.35
  Downloaded regex-syntax v0.8.5
  Downloaded rustix v0.38.44
  Downloaded tracing-opentelemetry v0.28.0
  Downloaded opentelemetry-proto v0.27.0
  Downloaded rustls v0.23.23
  Downloaded portable-atomic v1.11.0
  Downloaded winnow v0.6.26
  Downloaded clap_builder v4.5.32
  Downloaded serde_with v3.12.0
  Downloaded rustls-webpki v0.102.8
  Downloaded regex-automata v0.4.9
  Downloaded nix v0.27.1
  Downloaded gix v0.70.0
  Downloaded libc v0.2.171
  Downloaded libz-sys v1.1.21
  Downloaded bstr v1.11.3
  Downloaded tokio v1.44.0
  Downloaded rustix v1.0.2
  Downloaded linux-raw-sys v0.4.15
  Downloaded bzip2-sys v0.1.13+1.0.8
  Downloaded jiff v0.1.29
  Downloaded zstd-sys v2.0.14+zstd.1.5.7
  Downloaded encoding_rs v0.8.35
  Downloaded ring v0.17.14
  Downloaded libgit2-sys v0.18.0+1.9.0
  Downloaded linux-raw-sys v0.9.2
==> Starting build()...
   Compiling proc-macro2 v1.0.94
   Compiling unicode-ident v1.0.18
   Compiling libc v0.2.171
   Compiling cfg-if v1.0.0
   Compiling once_cell v1.21.0
   Compiling autocfg v1.4.0
   Compiling memchr v2.7.4
   Compiling log v0.4.26
   Compiling serde v1.0.219
   Compiling smallvec v1.14.0
   Compiling thiserror v2.0.12
   Compiling bytes v1.10.1
   Compiling itoa v1.0.15
   Compiling regex-syntax v0.8.5
   Compiling parking_lot_core v0.9.10
   Compiling aho-corasick v1.1.3
   Compiling version_check v0.9.5
   Compiling quote v1.0.40
   Compiling lock_api v0.4.12
   Compiling syn v2.0.100
   Compiling scopeguard v1.2.0
   Compiling gix-trace v0.1.12
   Compiling parking_lot v0.12.3
   Compiling tinyvec_macros v0.1.1
   Compiling tinyvec v1.9.0
   Compiling shlex v1.3.0
   Compiling fastrand v2.3.0
   Compiling jobserver v0.1.32
   Compiling crc32fast v1.4.2
   Compiling adler2 v2.0.0
   Compiling cc v1.2.16
   Compiling miniz_oxide v0.8.5
   Compiling unicode-normalization v0.1.24
   Compiling bitflags v2.9.0
   Compiling regex-automata v0.4.9
   Compiling gix-utils v0.1.14
   Compiling same-file v1.0.6
   Compiling walkdir v2.5.0
   Compiling flate2 v1.1.0
   Compiling prodash v29.0.1
   Compiling home v0.5.11
   Compiling sha1_smol v1.0.1
   Compiling synstructure v0.13.1
   Compiling stable_deref_trait v1.2.0
   Compiling pin-project-lite v0.2.16
   Compiling ahash v0.8.11
   Compiling bstr v1.11.3
   Compiling getrandom v0.3.1
   Compiling fnv v1.0.7
   Compiling signal-hook-registry v1.4.2
   Compiling zerocopy v0.7.35
   Compiling mio v1.0.3
   Compiling allocator-api2 v0.2.21
   Compiling jiff v0.1.29
   Compiling futures-core v0.3.31
   Compiling hashbrown v0.14.5
   Compiling winnow v0.6.26
   Compiling writeable v0.5.5
   Compiling litemap v0.7.5
   Compiling http v1.3.1
   Compiling getrandom v0.2.15
   Compiling slab v0.4.9
   Compiling futures-sink v0.3.31
   Compiling icu_locid_transform_data v1.5.0
   Compiling pkg-config v0.3.32
   Compiling subtle v2.6.1
   Compiling memmap2 v0.9.5
   Compiling serde_derive v1.0.219
   Compiling thiserror-impl v2.0.12
   Compiling zerofrom-derive v0.1.6
   Compiling yoke-derive v0.7.5
   Compiling zerovec-derive v0.10.3
   Compiling displaydoc v0.2.5
   Compiling gix-path v0.10.14
   Compiling gix-date v0.9.3
   Compiling zerofrom v0.1.6
   Compiling yoke v0.7.5
   Compiling gix-actor v0.33.2
   Compiling gix-validate v0.9.3
   Compiling zerovec v0.10.4
   Compiling icu_provider_macros v1.5.0
   Compiling tokio-macros v2.5.0
   Compiling socket2 v0.5.8
   Compiling tracing-core v0.1.33
   Compiling tinystr v0.7.6
   Compiling icu_locid v1.5.0
   Compiling icu_collections v1.5.0
   Compiling icu_provider v1.5.0
   Compiling typenum v1.18.0
   Compiling icu_locid_transform v1.5.0
   Compiling icu_properties_data v1.5.0
   Compiling rustix v1.0.2
   Compiling icu_properties v1.5.1
   Compiling tokio v1.44.0
   Compiling faster-hex v0.9.0
   Compiling futures-macro v0.3.31
   Compiling gix-hash v0.16.0
   Compiling gix-features v0.40.0
   Compiling gix-hashtable v0.7.0
   Compiling gix-object v0.47.0
   Compiling zeroize_derive v1.4.2
   Compiling futures-channel v0.3.31
   Compiling ring v0.17.14
   Compiling generic-array v0.14.7
   Compiling linux-raw-sys v0.9.2
   Compiling rustls-pki-types v1.11.0
   Compiling hashbrown v0.15.2
   Compiling icu_normalizer_data v1.5.0
   Compiling pin-utils v0.1.0
   Compiling futures-task v0.3.31
   Compiling futures-io v0.3.31
   Compiling write16 v1.0.0
   Compiling utf16_iter v1.0.5
   Compiling utf8_iter v1.0.4
   Compiling equivalent v1.0.2
   Compiling icu_normalizer v1.5.0
   Compiling futures-util v0.3.31
   Compiling indexmap v2.8.0
   Compiling zeroize v1.8.1
   Compiling tracing-attributes v0.1.28
   Compiling percent-encoding v2.3.1
   Compiling httparse v1.10.1
   Compiling form_urlencoded v1.2.1
   Compiling tempfile v3.18.0
   Compiling idna_adapter v1.2.0
   Compiling gix-fs v0.13.0
   Compiling gix-chunk v0.4.11
   Compiling rustix v0.38.44
   Compiling untrusted v0.9.0
   Compiling gix-tempfile v16.0.0
   Compiling idna v1.0.3
   Compiling serde_json v1.0.140
   Compiling ryu v1.0.20
error[E0080]: evaluation of constant value failed
  --> /build/.cargo/registry/src/index.crates.io-1cd66030c949c28d/ring-0.17.14/src/cpu/intel.rs:26:9
   |
26 |         assert!(cfg!(target_feature = "sse") && cfg!(target_feature = "sse2"));
   |         ^^^^^^^^^^^^^^^^^^^^^^^^^^^^^^^^^^^^^^^^^^^^^^^^^^^^^^^^^^^^^^^^^^^^^^ the evaluated program panicked at 'assertion failed: cfg!(target_feature = "sse") && cfg!(target_feature = "sse2")', /build/.cargo/registry/src/index.crates.io-1cd66030c949c28d/ring-0.17.14/src/cpu/intel.rs:26:9
   |
   = note: this error originates in the macro `assert` (in Nightly builds, run with -Z macro-backtrace for more info)

error[E0080]: evaluation of constant value failed
   --> /build/.cargo/registry/src/index.crates.io-1cd66030c949c28d/ring-0.17.14/src/cpu/intel.rs:160:32
    |
160 |     const _SSE2_REQUIRED: () = assert!(cfg!(target_feature = "sse2"));
    |                                ^^^^^^^^^^^^^^^^^^^^^^^^^^^^^^^^^^^^^^ the evaluated program panicked at 'assertion failed: cfg!(target_feature = "sse2")', /build/.cargo/registry/src/index.crates.io-1cd66030c949c28d/ring-0.17.14/src/cpu/intel.rs:160:32
    |
    = note: this error originates in the macro `assert` (in Nightly builds, run with -Z macro-backtrace for more info)

   Compiling tracing v0.1.41
   Compiling rustls v0.23.23
   Compiling linux-raw-sys v0.4.15
   Compiling url v2.5.4
   Compiling tokio-util v0.7.13
For more information about this error, try `rustc --explain E0080`.
error: could not compile `ring` (lib) due to 2 previous errors
warning: build failed, waiting for other jobs to finish...
==> ERROR: A failure occurred in build().
    Aborting...
==> ERROR: Build failed, check /var/lib/archbuild/extra-staging-i686/build/build
[?12l[?25h[?12l[?25hused straw: :without_check:
build@euronuc.lan